id,rd,ses4,age,best_schlgrp,repeat,cbrwaz,cbrhaz,ses_score,edu_f,edu_m,motherheight,mageatb,season_birth,agestart,mummuac,cbrstunting,bfupstunting,age4grade,sex,fivestunting
799696932,1,Moderately poor,5,,,-.43,-.71,Least Poor,None/<Primary,None/<Primary,160.9,40.533882,"Hot, Dry",,Maternal malnutrition- No,Normal,Normal,,Female,Normal
799696932,2,Moderately poor,5,1,Never,-.43,-.71,Least Poor,None/<Primary,None/<Primary,160.9,40.533882,"Hot, Dry",Underage <6yrs,Maternal malnutrition- No,Normal,Normal,Under/At Age,Female,Normal
799696932,7,Moderately poor,11,4,Never,-.43,-.71,Least Poor,None/<Primary,None/<Primary,160.9,40.533882,"Hot, Dry",Underage <6yrs,Maternal malnutrition- No,Normal,Normal,1yr,Female,Normal
799696932,8,Moderately poor,12,5,Never,-.43,-.71,Least Poor,None/<Primary,None/<Primary,160.9,40.533882,"Hot, Dry",Underage <6yrs,Maternal malnutrition- No,Normal,Normal,1yr,Female,Normal
799696932,9,Moderately poor,13,6,Never,-.43,-.71,Least Poor,None/<Primary,None/<Primary,160.9,40.533882,"Hot, Dry",Underage <6yrs,Maternal malnutrition- No,Normal,Normal,1yr,Female,Normal
538636517,1,Moderately poor,5,,,-.51,.52,Most Poor,None/<Primary,None/<Primary,155,29.577002,"Hot, Dry",,Maternal malnutrition- No,Normal,Normal,,Male,Normal
538636517,2,Moderately poor,5,,,-.51,.52,Most Poor,None/<Primary,None/<Primary,155,29.577002,"Hot, Dry",,Maternal malnutrition- No,Normal,Normal,,Male,Normal
538636517,3,Moderately poor,6,1,Never,-.51,.52,Most Poor,None/<Primary,None/<Primary,155,29.577002,"Hot, Dry",At age-6yrs,Maternal malnutrition- No,Normal,Normal,Under/At Age,Male,Normal
538636517,4,Moderately poor,8,2,Never,-.51,.52,Most Poor,None/<Primary,None/<Primary,155,29.577002,"Hot, Dry",At age-6yrs,Maternal malnutrition- No,Normal,Normal,Under/At Age,Male,Normal
538636517,5,Moderately poor,9,3,Never,-.51,.52,Most Poor,None/<Primary,None/<Primary,155,29.577002,"Hot, Dry",At age-6yrs,Maternal malnutrition- No,Normal,Normal,Under/At Age,Male,Normal
538636517,6,Moderately poor,10,3,1+ times,-.51,.52,Most Poor,None/<Primary,None/<Primary,155,29.577002,"Hot, Dry",At age-6yrs,Maternal malnutrition- No,Normal,Normal,1yr,Male,Normal
538636517,7,Moderately poor,10,5,Never,-.51,.52,Most Poor,None/<Primary,None/<Primary,155,29.577002,"Hot, Dry",At age-6yrs,Maternal malnutrition- No,Normal,Normal,Under/At Age,Male,Normal
538636517,8,Moderately poor,12,5,1+ times,-.51,.52,Most Poor,None/<Primary,None/<Primary,155,29.577002,"Hot, Dry",At age-6yrs,Maternal malnutrition- No,Normal,Normal,1yr,Male,Normal
538636517,9,Moderately poor,13,5,1+ times,-.51,.52,Most Poor,None/<Primary,None/<Primary,155,29.577002,"Hot, Dry",At age-6yrs,Maternal malnutrition- No,Normal,Normal,2+yrs,Male,Normal
265323339,1,Moderately poor,4,,,-1.45,-.35,Most Poor,None/<Primary,None/<Primary,153.5,19.452431,"Hot, Dry",,Maternal malnutrition- No,Normal,Normal,,Female,Moderate/Severe
265323339,2,Moderately poor,5,,,-1.45,-.35,Most Poor,None/<Primary,None/<Primary,153.5,19.452431,"Hot, Dry",,Maternal malnutrition- No,Normal,Normal,,Female,Moderate/Severe
612704576,1,Most poor,4,,,-.51,-1.23,Most Poor,At least PSLE,None/<Primary,156.5,27.5154,"Hot, Dry",,Maternal malnutrition- No,Normal,Normal,,Female,Normal
612704576,2,Most poor,5,,,-.51,-1.23,Most Poor,At least PSLE,None/<Primary,156.5,27.5154,"Hot, Dry",,Maternal malnutrition- No,Normal,Normal,,Female,Normal
612704576,3,Most poor,6,1,Never,-.51,-1.23,Most Poor,At least PSLE,None/<Primary,156.5,27.5154,"Hot, Dry",At age-6yrs,Maternal malnutrition- No,Normal,Normal,Under/At Age,Female,Normal
612704576,4,Most poor,7,3,Never,-.51,-1.23,Most Poor,At least PSLE,None/<Primary,156.5,27.5154,"Hot, Dry",At age-6yrs,Maternal malnutrition- No,Normal,Normal,Under/At Age,Female,Normal
612704576,5,Most poor,8,3,1+ times,-.51,-1.23,Most Poor,At least PSLE,None/<Primary,156.5,27.5154,"Hot, Dry",At age-6yrs,Maternal malnutrition- No,Normal,Normal,Under/At Age,Female,Normal
612704576,6,Most poor,9,4,Never,-.51,-1.23,Most Poor,At least PSLE,None/<Primary,156.5,27.5154,"Hot, Dry",At age-6yrs,Maternal malnutrition- No,Normal,Normal,Under/At Age,Female,Normal
612704576,7,Most poor,10,4,1+ times,-.51,-1.23,Most Poor,At least PSLE,None/<Primary,156.5,27.5154,"Hot, Dry",At age-6yrs,Maternal malnutrition- No,Normal,Normal,Under/At Age,Female,Normal
612704576,8,Most poor,11,5,Never,-.51,-1.23,Most Poor,At least PSLE,None/<Primary,156.5,27.5154,"Hot, Dry",At age-6yrs,Maternal malnutrition- No,Normal,Normal,Under/At Age,Female,Normal
612704576,9,Most poor,12,6,Never,-.51,-1.23,Most Poor,At least PSLE,None/<Primary,156.5,27.5154,"Hot, Dry",At age-6yrs,Maternal malnutrition- No,Normal,Normal,Under/At Age,Female,Normal
343764457,1,Moderately poor,4,,,-2.27,-1.91,Moderately poor,None/<Primary,None/<Primary,156.9,31.581108,"Hot, Dry",,Maternal malnutrition- No,Normal,Normal,,Male,Moderate/Severe
343764457,2,Moderately poor,5,,,-2.27,-1.91,Moderately poor,None/<Primary,None/<Primary,156.9,31.581108,"Hot, Dry",,Maternal malnutrition- No,Normal,Normal,,Male,Moderate/Severe
343764457,3,Moderately poor,6,,,-2.27,-1.91,Moderately poor,None/<Primary,None/<Primary,156.9,31.581108,"Hot, Dry",,Maternal malnutrition- No,Normal,Normal,,Male,Moderate/Severe
343764457,4,Moderately poor,7,1,Never,-2.27,-1.91,Moderately poor,None/<Primary,None/<Primary,156.9,31.581108,"Hot, Dry",At age-6yrs,Maternal malnutrition- No,Normal,Normal,Under/At Age,Male,Moderate/Severe
343764457,5,Moderately poor,8,1,1+ times,-2.27,-1.91,Moderately poor,None/<Primary,None/<Primary,156.9,31.581108,"Hot, Dry",At age-6yrs,Maternal malnutrition- No,Normal,Normal,1yr,Male,Moderate/Severe
343764457,6,Moderately poor,9,2,Never,-2.27,-1.91,Moderately poor,None/<Primary,None/<Primary,156.9,31.581108,"Hot, Dry",At age-6yrs,Maternal malnutrition- No,Normal,Normal,1yr,Male,Moderate/Severe
343764457,7,Moderately poor,10,3,Never,-2.27,-1.91,Moderately poor,None/<Primary,None/<Primary,156.9,31.581108,"Hot, Dry",At age-6yrs,Maternal malnutrition- No,Normal,Normal,1yr,Male,Moderate/Severe
343764457,8,Moderately poor,11,3,1+ times,-2.27,-1.91,Moderately poor,None/<Primary,None/<Primary,156.9,31.581108,"Hot, Dry",At age-6yrs,Maternal malnutrition- No,Normal,Normal,2+yrs,Male,Moderate/Severe
343764457,9,Moderately poor,12,3,1+ times,-2.27,-1.91,Moderately poor,None/<Primary,None/<Primary,156.9,31.581108,"Hot, Dry",At age-6yrs,Maternal malnutrition- No,Normal,Normal,2+yrs,Male,Moderate/Severe
15028164,1,Moderately poor,5,,,.38,.45,Most Poor,At least PSLE,At least PSLE,150,21.59343,"Warm, Rainy",,Maternal malnutrition- No,Normal,Normal,,Female,Normal
15028164,2,Moderately poor,5,,,.38,.45,Most Poor,At least PSLE,At least PSLE,150,21.59343,"Warm, Rainy",,Maternal malnutrition- No,Normal,Normal,,Female,Normal
15028164,3,Moderately poor,6,2,Never,.38,.45,Most Poor,At least PSLE,At least PSLE,150,21.59343,"Warm, Rainy",Underage <6yrs,Maternal malnutrition- No,Normal,Normal,Under/At Age,Female,Normal
142225008,1,Least poor,5,,,-.8200000000000001,-.9300000000000001,Most Poor,None/<Primary,None/<Primary,154,19.608488,"Warm, Rainy",,Maternal malnutrition- No,Normal,Normal,,Male,Moderate/Severe
142225008,3,Least poor,7,2,Never,-.8200000000000001,-.9300000000000001,Most Poor,None/<Primary,None/<Primary,154,19.608488,"Warm, Rainy",At age-6yrs,Maternal malnutrition- No,Normal,Normal,Under/At Age,Male,Moderate/Severe
142225008,4,Least poor,8,3,Never,-.8200000000000001,-.9300000000000001,Most Poor,None/<Primary,None/<Primary,154,19.608488,"Warm, Rainy",At age-6yrs,Maternal malnutrition- No,Normal,Normal,Under/At Age,Male,Moderate/Severe
142225008,5,Least poor,9,4,Never,-.8200000000000001,-.9300000000000001,Most Poor,None/<Primary,None/<Primary,154,19.608488,"Warm, Rainy",At age-6yrs,Maternal malnutrition- No,Normal,Normal,Under/At Age,Male,Moderate/Severe
142225008,6,Least poor,10,4,1+ times,-.8200000000000001,-.9300000000000001,Most Poor,None/<Primary,None/<Primary,154,19.608488,"Warm, Rainy",At age-6yrs,Maternal malnutrition- No,Normal,Normal,Under/At Age,Male,Moderate/Severe
142225008,7,Least poor,11,5,Never,-.8200000000000001,-.9300000000000001,Most Poor,None/<Primary,None/<Primary,154,19.608488,"Warm, Rainy",At age-6yrs,Maternal malnutrition- No,Normal,Normal,Under/At Age,Male,Moderate/Severe
142225008,8,Least poor,12,6,Never,-.8200000000000001,-.9300000000000001,Most Poor,None/<Primary,None/<Primary,154,19.608488,"Warm, Rainy",At age-6yrs,Maternal malnutrition- No,Normal,Normal,Under/At Age,Male,Moderate/Severe
142225008,9,Least poor,13,7,Never,-.8200000000000001,-.9300000000000001,Most Poor,None/<Primary,None/<Primary,154,19.608488,"Warm, Rainy",At age-6yrs,Maternal malnutrition- No,Normal,Normal,Under/At Age,Male,Moderate/Severe
424986841,1,Least poor,4,,,-1.64,-.64,Least Poor,At least PSLE,None/<Primary,162.3500061035156,21.566051,"Hot, Dry",,Maternal malnutrition- No,Normal,Normal,,Male,Normal
424986841,2,Least poor,5,,,-1.64,-.64,Least Poor,At least PSLE,None/<Primary,162.3500061035156,21.566051,"Hot, Dry",,Maternal malnutrition- No,Normal,Normal,,Male,Normal
424986841,3,Least poor,6,1,Never,-1.64,-.64,Least Poor,At least PSLE,None/<Primary,162.3500061035156,21.566051,"Hot, Dry",Underage <6yrs,Maternal malnutrition- No,Normal,Normal,Under/At Age,Male,Normal
424986841,4,Least poor,7,3,Never,-1.64,-.64,Least Poor,At least PSLE,None/<Primary,162.3500061035156,21.566051,"Hot, Dry",Underage <6yrs,Maternal malnutrition- No,Normal,Normal,Under/At Age,Male,Normal
424986841,5,Least poor,8,3,1+ times,-1.64,-.64,Least Poor,At least PSLE,None/<Primary,162.3500061035156,21.566051,"Hot, Dry",Underage <6yrs,Maternal malnutrition- No,Normal,Normal,Under/At Age,Male,Normal
424986841,6,Least poor,9,4,Never,-1.64,-.64,Least Poor,At least PSLE,None/<Primary,162.3500061035156,21.566051,"Hot, Dry",Underage <6yrs,Maternal malnutrition- No,Normal,Normal,Under/At Age,Male,Normal
424986841,7,Least poor,10,5,Never,-1.64,-.64,Least Poor,At least PSLE,None/<Primary,162.3500061035156,21.566051,"Hot, Dry",Underage <6yrs,Maternal malnutrition- No,Normal,Normal,Under/At Age,Male,Normal
424986841,8,Least poor,11,5,1+ times,-1.64,-.64,Least Poor,At least PSLE,None/<Primary,162.3500061035156,21.566051,"Hot, Dry",Underage <6yrs,Maternal malnutrition- No,Normal,Normal,Under/At Age,Male,Normal
424986841,9,Least poor,12,6,Never,-1.64,-.64,Least Poor,At least PSLE,None/<Primary,162.3500061035156,21.566051,"Hot, Dry",Underage <6yrs,Maternal malnutrition- No,Normal,Normal,Under/At Age,Male,Normal
61875070,1,Moderately poor,4,,,-1.07,-.77,Moderately poor,At least PSLE,None/<Primary,162.3,30.66119,"Warm, Rainy",,Yes,Normal,Normal,,Male,Normal
61875070,2,Moderately poor,5,1,Never,-1.07,-.77,Moderately poor,At least PSLE,None/<Primary,162.3,30.66119,"Warm, Rainy",Underage <6yrs,Yes,Normal,Normal,Under/At Age,Male,Normal
61875070,3,Moderately poor,6,2,Never,-1.07,-.77,Moderately poor,At least PSLE,None/<Primary,162.3,30.66119,"Warm, Rainy",Underage <6yrs,Yes,Normal,Normal,Under/At Age,Male,Normal
61875070,4,Moderately poor,8,2,1+ times,-1.07,-.77,Moderately poor,At least PSLE,None/<Primary,162.3,30.66119,"Warm, Rainy",Underage <6yrs,Yes,Normal,Normal,Under/At Age,Male,Normal
61875070,5,Moderately poor,8,3,Never,-1.07,-.77,Moderately poor,At least PSLE,None/<Primary,162.3,30.66119,"Warm, Rainy",Underage <6yrs,Yes,Normal,Normal,Under/At Age,Male,Normal
61875070,6,Moderately poor,10,4,Never,-1.07,-.77,Moderately poor,At least PSLE,None/<Primary,162.3,30.66119,"Warm, Rainy",Underage <6yrs,Yes,Normal,Normal,Under/At Age,Male,Normal
61875070,7,Moderately poor,10,5,Never,-1.07,-.77,Moderately poor,At least PSLE,None/<Primary,162.3,30.66119,"Warm, Rainy",Underage <6yrs,Yes,Normal,Normal,Under/At Age,Male,Normal
61875070,8,Moderately poor,12,6,Never,-1.07,-.77,Moderately poor,At least PSLE,None/<Primary,162.3,30.66119,"Warm, Rainy",Underage <6yrs,Yes,Normal,Normal,Under/At Age,Male,Normal
61875070,9,Moderately poor,13,7,Never,-1.07,-.77,Moderately poor,At least PSLE,None/<Primary,162.3,30.66119,"Warm, Rainy",Underage <6yrs,Yes,Normal,Normal,Under/At Age,Male,Normal
58334052,1,Least poor,5,,,.24,-.06,Least Poor,At least PSLE,At least PSLE,154,29.713894,"Warm, Rainy",,Maternal malnutrition- No,Normal,Normal,,Male,Normal
58334052,2,Least poor,6,1,Never,.24,-.06,Least Poor,At least PSLE,At least PSLE,154,29.713894,"Warm, Rainy",Underage <6yrs,Maternal malnutrition- No,Normal,Normal,Under/At Age,Male,Normal
58334052,3,Least poor,6,2,Never,.24,-.06,Least Poor,At least PSLE,At least PSLE,154,29.713894,"Warm, Rainy",Underage <6yrs,Maternal malnutrition- No,Normal,Normal,Under/At Age,Male,Normal
58334052,4,Least poor,8,3,Never,.24,-.06,Least Poor,At least PSLE,At least PSLE,154,29.713894,"Warm, Rainy",Underage <6yrs,Maternal malnutrition- No,Normal,Normal,Under/At Age,Male,Normal
58334052,5,Least poor,9,4,Never,.24,-.06,Least Poor,At least PSLE,At least PSLE,154,29.713894,"Warm, Rainy",Underage <6yrs,Maternal malnutrition- No,Normal,Normal,Under/At Age,Male,Normal
58334052,6,Least poor,10,4,1+ times,.24,-.06,Least Poor,At least PSLE,At least PSLE,154,29.713894,"Warm, Rainy",Underage <6yrs,Maternal malnutrition- No,Normal,Normal,Under/At Age,Male,Normal
58334052,7,Least poor,11,5,Never,.24,-.06,Least Poor,At least PSLE,At least PSLE,154,29.713894,"Warm, Rainy",Underage <6yrs,Maternal malnutrition- No,Normal,Normal,Under/At Age,Male,Normal
58334052,8,Least poor,12,5,1+ times,.24,-.06,Least Poor,At least PSLE,At least PSLE,154,29.713894,"Warm, Rainy",Underage <6yrs,Maternal malnutrition- No,Normal,Normal,1yr,Male,Normal
58334052,9,Least poor,13,6,Never,.24,-.06,Least Poor,At least PSLE,At least PSLE,154,29.713894,"Warm, Rainy",Underage <6yrs,Maternal malnutrition- No,Normal,Normal,1yr,Male,Normal
170427241,1,Least poor,5,1,1+ times,-.72,-1.07,Least Poor,None/<Primary,None/<Primary,161,30.672142,"Warm, Rainy",Underage <6yrs,Maternal malnutrition- No,Normal,Normal,Under/At Age,Female,Normal
170427241,2,Least poor,6,1,1+ times,-.72,-1.07,Least Poor,None/<Primary,None/<Primary,161,30.672142,"Warm, Rainy",Underage <6yrs,Maternal malnutrition- No,Normal,Normal,Under/At Age,Female,Normal
170427241,3,Least poor,6,2,Never,-.72,-1.07,Least Poor,None/<Primary,None/<Primary,161,30.672142,"Warm, Rainy",Underage <6yrs,Maternal malnutrition- No,Normal,Normal,Under/At Age,Female,Normal
170427241,4,Least poor,8,3,Never,-.72,-1.07,Least Poor,None/<Primary,None/<Primary,161,30.672142,"Warm, Rainy",Underage <6yrs,Maternal malnutrition- No,Normal,Normal,Under/At Age,Female,Normal
170427241,5,Least poor,9,4,Never,-.72,-1.07,Least Poor,None/<Primary,None/<Primary,161,30.672142,"Warm, Rainy",Underage <6yrs,Maternal malnutrition- No,Normal,Normal,Under/At Age,Female,Normal
170427241,6,Least poor,10,5,Never,-.72,-1.07,Least Poor,None/<Primary,None/<Primary,161,30.672142,"Warm, Rainy",Underage <6yrs,Maternal malnutrition- No,Normal,Normal,Under/At Age,Female,Normal
170427241,7,Least poor,11,5,1+ times,-.72,-1.07,Least Poor,None/<Primary,None/<Primary,161,30.672142,"Warm, Rainy",Underage <6yrs,Maternal malnutrition- No,Normal,Normal,Under/At Age,Female,Normal
170427241,8,Least poor,12,6,Never,-.72,-1.07,Least Poor,None/<Primary,None/<Primary,161,30.672142,"Warm, Rainy",Underage <6yrs,Maternal malnutrition- No,Normal,Normal,Under/At Age,Female,Normal
170427241,9,Least poor,13,6,1+ times,-.72,-1.07,Least Poor,None/<Primary,None/<Primary,161,30.672142,"Warm, Rainy",Underage <6yrs,Maternal malnutrition- No,Normal,Normal,1yr,Female,Normal
299943129,1,Moderately poor,5,,,-.12,-.49,Moderately poor,None/<Primary,None/<Primary,154.2,38.685833,"Warm, Rainy",,Maternal malnutrition- No,Normal,Normal,,Male,Normal
299943129,2,Moderately poor,6,,,-.12,-.49,Moderately poor,None/<Primary,None/<Primary,154.2,38.685833,"Warm, Rainy",,Maternal malnutrition- No,Normal,Normal,,Male,Normal
299943129,3,Moderately poor,6,1,Never,-.12,-.49,Moderately poor,None/<Primary,None/<Primary,154.2,38.685833,"Warm, Rainy",At age-6yrs,Maternal malnutrition- No,Normal,Normal,Under/At Age,Male,Normal
299943129,4,Moderately poor,8,2,Never,-.12,-.49,Moderately poor,None/<Primary,None/<Primary,154.2,38.685833,"Warm, Rainy",At age-6yrs,Maternal malnutrition- No,Normal,Normal,Under/At Age,Male,Normal
299943129,5,Moderately poor,8,3,Never,-.12,-.49,Moderately poor,None/<Primary,None/<Primary,154.2,38.685833,"Warm, Rainy",At age-6yrs,Maternal malnutrition- No,Normal,Normal,Under/At Age,Male,Normal
299943129,6,Moderately poor,10,3,1+ times,-.12,-.49,Moderately poor,None/<Primary,None/<Primary,154.2,38.685833,"Warm, Rainy",At age-6yrs,Maternal malnutrition- No,Normal,Normal,1yr,Male,Normal
299943129,7,Moderately poor,10,4,Never,-.12,-.49,Moderately poor,None/<Primary,None/<Primary,154.2,38.685833,"Warm, Rainy",At age-6yrs,Maternal malnutrition- No,Normal,Normal,Under/At Age,Male,Normal
299943129,8,Moderately poor,12,5,Never,-.12,-.49,Moderately poor,None/<Primary,None/<Primary,154.2,38.685833,"Warm, Rainy",At age-6yrs,Maternal malnutrition- No,Normal,Normal,1yr,Male,Normal
299943129,9,Moderately poor,13,6,Never,-.12,-.49,Moderately poor,None/<Primary,None/<Primary,154.2,38.685833,"Warm, Rainy",At age-6yrs,Maternal malnutrition- No,Normal,Normal,1yr,Male,Normal
614374005,1,Least poor,4,,,-.02,2.04,Most Poor,None/<Primary,None/<Primary,160.3,34.973305,"Warm, Rainy",,Maternal malnutrition- No,Normal,Normal,,Male,Normal
614374005,2,Least poor,5,,,-.02,2.04,Most Poor,None/<Primary,None/<Primary,160.3,34.973305,"Warm, Rainy",,Maternal malnutrition- No,Normal,Normal,,Male,Normal
614374005,3,Least poor,6,1,Never,-.02,2.04,Most Poor,None/<Primary,None/<Primary,160.3,34.973305,"Warm, Rainy",At age-6yrs,Maternal malnutrition- No,Normal,Normal,Under/At Age,Male,Normal
614374005,4,Least poor,8,1,1+ times,-.02,2.04,Most Poor,None/<Primary,None/<Primary,160.3,34.973305,"Warm, Rainy",At age-6yrs,Maternal malnutrition- No,Normal,Normal,1yr,Male,Normal
614374005,5,Least poor,8,2,Never,-.02,2.04,Most Poor,None/<Primary,None/<Primary,160.3,34.973305,"Warm, Rainy",At age-6yrs,Maternal malnutrition- No,Normal,Normal,Under/At Age,Male,Normal
614374005,6,Least poor,10,3,Never,-.02,2.04,Most Poor,None/<Primary,None/<Primary,160.3,34.973305,"Warm, Rainy",At age-6yrs,Maternal malnutrition- No,Normal,Normal,1yr,Male,Normal
614374005,7,Least poor,10,4,Never,-.02,2.04,Most Poor,None/<Primary,None/<Primary,160.3,34.973305,"Warm, Rainy",At age-6yrs,Maternal malnutrition- No,Normal,Normal,Under/At Age,Male,Normal
614374005,8,Least poor,12,4,1+ times,-.02,2.04,Most Poor,None/<Primary,None/<Primary,160.3,34.973305,"Warm, Rainy",At age-6yrs,Maternal malnutrition- No,Normal,Normal,2+yrs,Male,Normal
614374005,9,Least poor,13,5,Never,-.02,2.04,Most Poor,None/<Primary,None/<Primary,160.3,34.973305,"Warm, Rainy",At age-6yrs,Maternal malnutrition- No,Normal,Normal,2+yrs,Male,Normal
1656350,1,Least poor,5,,,-.79,-1.31,Least Poor,At least PSLE,At least PSLE,,29.686516,"Warm, Rainy",,Maternal malnutrition- No,Normal,Normal,,Female,Normal
1656350,2,Least poor,6,1,Never,-.79,-1.31,Least Poor,At least PSLE,At least PSLE,,29.686516,"Warm, Rainy",At age-6yrs,Maternal malnutrition- No,Normal,Normal,Under/At Age,Female,Normal
1656350,3,Least poor,7,2,Never,-.79,-1.31,Least Poor,At least PSLE,At least PSLE,,29.686516,"Warm, Rainy",At age-6yrs,Maternal malnutrition- No,Normal,Normal,Under/At Age,Female,Normal
1656350,6,Least poor,10,4,Never,-.79,-1.31,Least Poor,At least PSLE,At least PSLE,,29.686516,"Warm, Rainy",At age-6yrs,Maternal malnutrition- No,Normal,Normal,Under/At Age,Female,Normal
1656350,7,Least poor,10,5,Never,-.79,-1.31,Least Poor,At least PSLE,At least PSLE,,29.686516,"Warm, Rainy",At age-6yrs,Maternal malnutrition- No,Normal,Normal,Under/At Age,Female,Normal
1656350,8,Least poor,12,6,Never,-.79,-1.31,Least Poor,At least PSLE,At least PSLE,,29.686516,"Warm, Rainy",At age-6yrs,Maternal malnutrition- No,Normal,Normal,Under/At Age,Female,Normal
1656350,9,Least poor,13,6,1+ times,-.79,-1.31,Least Poor,At least PSLE,At least PSLE,,29.686516,"Warm, Rainy",At age-6yrs,Maternal malnutrition- No,Normal,Normal,1yr,Female,Normal
363335098,1,Moderately poor,4,,,-.16,-.43,Least Poor,At least PSLE,None/<Primary,157.5,27.622177,"Warm, Rainy",,Maternal malnutrition- No,Normal,Normal,,Male,Normal
363335098,2,Moderately poor,5,,,-.16,-.43,Least Poor,At least PSLE,None/<Primary,157.5,27.622177,"Warm, Rainy",,Maternal malnutrition- No,Normal,Normal,,Male,Normal
363335098,3,Moderately poor,6,2,Never,-.16,-.43,Least Poor,At least PSLE,None/<Primary,157.5,27.622177,"Warm, Rainy",At age-6yrs,Maternal malnutrition- No,Normal,Normal,Under/At Age,Male,Normal
363335098,4,Moderately poor,8,3,Never,-.16,-.43,Least Poor,At least PSLE,None/<Primary,157.5,27.622177,"Warm, Rainy",At age-6yrs,Maternal malnutrition- No,Normal,Normal,Under/At Age,Male,Normal
363335098,5,Moderately poor,8,4,Never,-.16,-.43,Least Poor,At least PSLE,None/<Primary,157.5,27.622177,"Warm, Rainy",At age-6yrs,Maternal malnutrition- No,Normal,Normal,Under/At Age,Male,Normal
363335098,6,Moderately poor,10,5,Never,-.16,-.43,Least Poor,At least PSLE,None/<Primary,157.5,27.622177,"Warm, Rainy",At age-6yrs,Maternal malnutrition- No,Normal,Normal,Under/At Age,Male,Normal
363335098,7,Moderately poor,10,6,Never,-.16,-.43,Least Poor,At least PSLE,None/<Primary,157.5,27.622177,"Warm, Rainy",At age-6yrs,Maternal malnutrition- No,Normal,Normal,Under/At Age,Male,Normal
363335098,8,Moderately poor,12,7,Never,-.16,-.43,Least Poor,At least PSLE,None/<Primary,157.5,27.622177,"Warm, Rainy",At age-6yrs,Maternal malnutrition- No,Normal,Normal,Under/At Age,Male,Normal
363335098,9,Moderately poor,13,8,Never,-.16,-.43,Least Poor,At least PSLE,None/<Primary,157.5,27.622177,"Warm, Rainy",At age-6yrs,Maternal malnutrition- No,Normal,Normal,Under/At Age,Male,Normal
373385106,1,Least poor,5,,,0,1.07,Most Poor,At least PSLE,None/<Primary,157.9,39.723476,"Warm, Rainy",,Maternal malnutrition- No,Normal,Normal,,Female,Normal
373385106,2,Least poor,5,1,Never,0,1.07,Most Poor,At least PSLE,None/<Primary,157.9,39.723476,"Warm, Rainy",Underage <6yrs,Maternal malnutrition- No,Normal,Normal,Under/At Age,Female,Normal
373385106,3,Least poor,6,2,Never,0,1.07,Most Poor,At least PSLE,None/<Primary,157.9,39.723476,"Warm, Rainy",Underage <6yrs,Maternal malnutrition- No,Normal,Normal,Under/At Age,Female,Normal
373385106,4,Least poor,8,3,Never,0,1.07,Most Poor,At least PSLE,None/<Primary,157.9,39.723476,"Warm, Rainy",Underage <6yrs,Maternal malnutrition- No,Normal,Normal,Under/At Age,Female,Normal
373385106,5,Least poor,8,3,1+ times,0,1.07,Most Poor,At least PSLE,None/<Primary,157.9,39.723476,"Warm, Rainy",Underage <6yrs,Maternal malnutrition- No,Normal,Normal,Under/At Age,Female,Normal
373385106,6,Least poor,10,4,Never,0,1.07,Most Poor,At least PSLE,None/<Primary,157.9,39.723476,"Warm, Rainy",Underage <6yrs,Maternal malnutrition- No,Normal,Normal,Under/At Age,Female,Normal
373385106,7,Least poor,10,4,1+ times,0,1.07,Most Poor,At least PSLE,None/<Primary,157.9,39.723476,"Warm, Rainy",Underage <6yrs,Maternal malnutrition- No,Normal,Normal,Under/At Age,Female,Normal
373385106,8,Least poor,12,5,Never,0,1.07,Most Poor,At least PSLE,None/<Primary,157.9,39.723476,"Warm, Rainy",Underage <6yrs,Maternal malnutrition- No,Normal,Normal,1yr,Female,Normal
373385106,9,Least poor,13,6,Never,0,1.07,,At least PSLE,None/<Primary,157.9,39.723476,"Warm, Rainy",Underage <6yrs,Maternal malnutrition- No,Normal,Normal,1yr,Female,Normal
250905480,2,Most poor,5,,,-.3,.19,Moderately poor,None/<Primary,None/<Primary,155.5,35.441479,"Hot, Dry",,Maternal malnutrition- No,Normal,Normal,,Male,Normal
250905480,3,Most poor,7,2,Never,-.3,.19,Moderately poor,None/<Primary,None/<Primary,155.5,35.441479,"Hot, Dry",At age-6yrs,Maternal malnutrition- No,Normal,Normal,Under/At Age,Male,Normal