﻿id,hiv_status,age,sex,preference,s3all_sex_planned,Frequency_of_sex_last_month,s1curr_student,house_hold_size,participant_is_house_hold,condom_use,country,alcohol_use,s2ondem_prep_main_reas,s2daily_prep_main_reas
1,HIV negative,2,1,2,4,4,1,2,1,2,SA,Daily or almost daily,,4
2,HIV negative,3,1,1,1,4,1,2,2,1,SA,Daily or almost daily,4,
3,HIV negative,3,1,2,1,0,2,2,2,1,SA,Daily or almost daily,,2
4,HIV negative,3,1,2,2,888,2,2,2,1,SA,Daily or almost daily,,5
5,HIV negative,2,1,2,1,1,1,2,2,1,SA,Daily or almost daily,,2
6,HIV negative,3,1,1,2,2,2,2,2,1,SA,Less than once a month,4,
7,HIV negative,3,1,2,1,4,2,2,2,1,SA,Less than once a month,,2
8,HIV negative,2,1,2,1,3,1,2,2,1,SA,Less than once a month,,2
9,HIV negative,3,1,1,1,3,2,2,2,2,SA,Less than once a month,6,
10,HIV negative,2,1,1,2,5,1,2,2,1,SA,Less than once a month,1,
11,HIV negative,2,1,2,3,5,1,2,2,1,SA,Less than once a month,,4
12,HIV negative,2,1,1,1,0,1,2,2,1,SA,Less than once a month,4,
13,HIV negative,3,1,2,4,3,2,2,2,1,Zimbabwe,Less than once a month,,2
14,HIV negative,3,1,2,2,3,2,2,2,2,SA,Less than once a month,,4
15,HIV negative,1,1,1,1,998,1,2,2,1,SA,Less than once a month,6,
16,HIV negative,3,1,2,1,5,2,2,2,2,SA,Less than once a month,,2
17,HIV negative,3,1,1,2,3,1,2,2,1,SA,Less than once a month,4,
18,HIV negative,1,1,1,3,5,1,2,2,1,SA,Less than once a month,1,
19,HIV negative,3,1,1,4,3,1,2,2,2,Zimbabwe,Less than once a month,1,
20,HIV negative,3,1,2,1,2,2,2,2,2,SA,Less than once a month,,6
21,HIV negative,3,1,1,1,4,2,2,2,1,Uganda,Less than once a month,1,
22,HIV negative,3,1,1,1,0,2,2,2,1,SA,Less than once a month,1,
23,HIV negative,3,1,1,2,5,2,2,2,1,SA,Less than once a month,1,
24,HIV negative,3,1,2,4,3,2,2,2,2,SA,Less than once a month,,5
25,HIV negative,1,1,2,1,0,1,2,2,1,SA,Less than once a month,,2
26,HIV negative,2,1,2,4,5,1,2,2,1,SA,Less than once a month,,5
27,HIV negative,3,1,1,4,0,1,2,2,1,Zimbabwe,Less than once a month,2,
28,HIV negative,3,1,1,2,5,1,2,2,1,Zimbabwe,Less than once a month,3,
29,HIV negative,3,1,1,4,0,2,2,2,2,Zimbabwe,Less than once a month,2,
30,HIV negative,3,1,1,2,4,2,2,2,1,Zimbabwe,Less than once a month,4,
31,HIV negative,3,1,1,4,5,1,2,2,2,Zimbabwe,Less than once a month,3,
32,HIV negative,3,1,1,4,4,2,2,2,2,Zimbabwe,Less than once a month,2,
33,HIV negative,3,1,2,1,3,2,2,2,2,Zimbabwe,Less than once a month,,2
34,HIV negative,2,1,1,2,5,1,2,2,2,Zimbabwe,Less than once a month,1,
35,HIV negative,3,1,1,4,4,2,2,2,2,SA,Less than once a month,1,
36,HIV negative,3,1,2,1,3,2,2,2,2,SA,Less than once a month,,1
37,HIV negative,3,1,2,4,998,1,2,2,1,SA,Less than once a month,,4
38,HIV negative,3,1,2,1,4,1,2,2,2,SA,Less than once a month,,2
39,HIV negative,3,1,2,2,2,1,2,2,2,SA,Less than once a month,,6
40,HIV negative,1,1,2,1,1,1,2,2,1,SA,Less than once a month,,6
41,HIV negative,2,1,1,4,0,2,2,1,2,SA,Less than once a month,4,
42,HIV negative,3,1,1,2,0,2,2,2,1,SA,Less than once a month,3,
43,HIV negative,3,1,1,1,5,1,2,2,1,SA,Less than once a month,2,
44,HIV negative,3,1,1,4,3,2,2,2,2,Zimbabwe,Less than once a month,1,
45,HIV negative,3,1,1,4,0,1,2,2,1,Zimbabwe,Less than once a month,1,
46,HIV negative,3,1,1,1,3,2,2,2,1,Zimbabwe,Less than once a month,4,
47,HIV negative,3,1,1,2,4,1,2,2,2,Zimbabwe,Less than once a month,2,
48,HIV negative,3,1,2,1,2,1,2,2,2,Zimbabwe,Less than once a month,,4
49,HIV negative,3,1,1,1,4,2,2,2,2,Zimbabwe,Less than once a month,1,
50,HIV negative,3,1,1,2,3,1,2,2,1,Zimbabwe,Less than once a month,3,
51,HIV negative,3,1,1,2,4,2,2,2,2,SA,Less than once a month,4,
52,HIV negative,3,1,2,4,4,2,2,2,2,SA,Less than once a month,,2
53,HIV negative,3,1,2,2,4,1,2,2,2,SA,Less than once a month,,1
54,HIV negative,1,1,1,2,5,1,2,2,1,SA,Less than once a month,4,
55,HIV negative,3,1,1,2,5,1,2,2,1,SA,Less than once a month,4,
56,HIV negative,1,1,1,2,5,1,2,2,1,SA,Less than once a month,6,
57,HIV negative,1,1,2,1,5,1,2,2,1,SA,Less than once a month,,4
58,HIV negative,3,1,1,,,1,2,2,,Uganda,Less than once a month,999,
59,HIV negative,3,1,1,4,888,1,2,2,1,SA,Less than once a month,3,
60,HIV negative,1,1,1,2,0,1,2,2,2,SA,Less than once a month,2,
61,HIV negative,2,1,2,1,3,1,2,2,1,SA,Less than once a month,,2
62,HIV negative,1,1,1,1,0,1,2,2,1,SA,Less than once a month,2,
63,HIV negative,2,1,2,2,0,1,2,2,1,SA,Less than once a month,,4
64,HIV negative,3,1,1,2,4,1,2,2,1,Zimbabwe,Less than once a month,3,
65,HIV negative,3,1,1,4,5,2,2,2,1,Zimbabwe,Less than once a month,4,
66,HIV negative,3,1,2,2,0,1,2,2,1,Zimbabwe,Less than once a month,,2
67,HIV negative,3,1,1,1,0,2,2,2,1,Zimbabwe,Less than once a month,1,
68,HIV negative,3,1,1,3,4,1,2,2,1,Zimbabwe,Less than once a month,1,
69,HIV negative,3,1,2,3,3,1,2,2,2,Zimbabwe,Less than once a month,,2
70,HIV negative,3,1,1,4,3,2,2,2,2,Zimbabwe,Less than once a month,3,
71,HIV negative,3,1,1,4,5,1,2,2,1,Zimbabwe,Less than once a month,1,
72,HIV negative,3,1,1,4,5,2,2,1,2,Zimbabwe,Less than once a month,1,
73,HIV negative,3,1,1,4,4,2,2,2,1,Zimbabwe,Less than once a month,999,
74,HIV negative,2,1,1,4,4,1,2,2,1,Zimbabwe,Less than once a month,999,
75,HIV negative,3,1,1,1,0,2,2,2,1,Zimbabwe,Less than once a month,4,
76,HIV negative,3,1,1,2,4,2,2,2,2,Zimbabwe,Less than once a month,1,
77,HIV negative,3,1,1,4,0,2,2,2,2,Zimbabwe,Less than once a month,4,
78,HIV negative,3,1,1,4,0,1,2,2,1,Zimbabwe,Less than once a month,4,
79,HIV negative,3,1,2,2,888,2,1,2,2,SA,Less than once a month,,3
80,HIV negative,3,1,1,4,5,1,1,2,2,SA,Less than once a month,4,
81,HIV negative,3,1,1,4,0,1,1,2,2,SA,Less than once a month,3,
82,HIV negative,3,1,1,1,3,2,1,1,2,Uganda,Less than once a month,6,
83,HIV negative,3,1,1,4,5,2,1,1,2,Uganda,Less than once a month,3,
84,HIV negative,3,1,1,1,3,2,1,1,2,Uganda,Less than once a month,3,
85,HIV negative,3,1,1,4,3,2,1,2,1,SA,Less than once a month,3,
86,HIV negative,3,1,1,1,0,1,1,2,1,SA,Less than once a month,1,
87,HIV negative,3,1,1,4,4,2,1,2,1,SA,Less than once a month,1,
88,HIV negative,3,1,1,1,4,1,1,2,1,SA,Less than once a month,3,
89,HIV negative,3,1,2,,,2,1,2,,Zimbabwe,Less than once a month,,1
90,HIV negative,1,1,2,,,1,1,2,,Zimbabwe,Less than once a month,,2
91,HIV negative,3,1,2,2,3,2,0,1,1,SA,Less than once a month,,2
92,HIV negative,3,1,1,3,0,2,0,1,2,Uganda,Less than once a month,3,
93,HIV negative,3,1,2,1,3,2,0,1,1,Uganda,Less than once a month,,2
94,HIV negative,3,1,1,4,3,2,0,1,1,Zimbabwe,Less than once a month,2,
95,HIV negative,3,1,1,4,2,2,2,2,2,SA,Monthly,2,
96,HIV negative,3,1,2,4,888,2,2,2,1,SA,Monthly,,2
97,HIV negative,3,1,2,1,2,1,2,2,2,SA,Monthly,,4
98,HIV negative,3,1,1,4,3,2,2,2,2,SA,Monthly,1,
99,HIV negative,2,1,2,4,4,1,2,2,2,SA,Monthly,,2
100,HIV negative,2,1,1,3,5,1,2,2,1,SA,Monthly,1,
101,HIV negative,3,1,2,1,4,2,2,2,1,SA,Monthly,,3
102,HIV negative,1,1,1,1,4,1,2,2,2,SA,Monthly,1,
103,HIV negative,3,1,2,4,3,1,2,2,1,SA,Monthly,,2
104,HIV negative,3,1,1,4,5,1,2,2,2,Uganda,Monthly,2,
105,HIV negative,3,1,2,1,3,2,2,2,1,SA,Monthly,,4
106,HIV negative,3,1,1,4,3,1,2,2,1,SA,Monthly,3,
107,HIV negative,2,1,1,4,998,1,2,2,1,SA,Monthly,1,
108,HIV negative,1,1,1,4,4,1,2,2,1,SA,Monthly,2,
109,HIV negative,3,1,2,3,3,2,2,2,2,SA,Monthly,,2
110,HIV negative,3,1,1,2,0,2,2,2,1,SA,Monthly,1,
111,HIV negative,3,1,1,2,3,2,2,2,2,SA,Monthly,1,
112,HIV negative,3,1,1,1,888,2,2,2,2,SA,Monthly,1,
113,HIV negative,3,1,1,1,5,1,2,2,2,SA,Monthly,1,
114,HIV negative,3,1,1,2,4,1,2,2,1,SA,Monthly,2,
115,HIV negative,3,1,1,1,5,2,2,2,1,Zimbabwe,Monthly,1,
116,HIV negative,3,1,1,,,2,2,2,,Zimbabwe,Monthly,1,
117,HIV negative,3,1,2,1,4,2,2,2,2,Zimbabwe,Monthly,,4
118,HIV negative,2,1,1,2,5,1,2,2,1,Zimbabwe,Monthly,2,
119,HIV negative,3,1,2,2,4,1,2,2,2,SA,Monthly,,2
120,HIV negative,3,1,2,4,3,2,2,2,1,SA,Monthly,,4
121,HIV negative,3,1,2,2,5,2,2,2,1,SA,Monthly,,3
122,HIV negative,3,1,2,1,4,2,2,2,1,SA,Monthly,,2
123,HIV negative,1,1,2,4,5,1,2,2,1,SA,Monthly,,5
124,HIV negative,2,1,2,3,3,1,2,2,2,SA,Monthly,,4
125,HIV negative,2,1,2,1,888,1,2,2,2,SA,Monthly,,2
126,HIV negative,3,1,1,4,4,2,2,2,2,Uganda,Monthly,999,
127,HIV negative,3,1,2,1,5,2,2,2,2,SA,Monthly,,2
128,HIV negative,3,1,2,1,3,2,2,2,2,SA,Monthly,,2
129,HIV negative,3,1,1,1,2,1,2,2,2,SA,Monthly,1,
130,HIV negative,3,1,1,1,3,1,2,2,1,SA,Monthly,2,
131,HIV negative,2,1,1,3,4,1,2,2,1,SA,Monthly,4,
132,HIV negative,3,1,2,2,4,1,2,2,1,SA,Monthly,,3
133,HIV negative,3,1,1,1,2,1,2,1,2,SA,Monthly,4,
134,HIV negative,3,1,1,2,888,2,2,2,1,SA,Monthly,1,
135,HIV negative,3,1,1,1,5,1,2,2,2,Zimbabwe,Monthly,2,
136,HIV negative,3,1,1,3,3,1,2,2,2,Zimbabwe,Monthly,4,
137,HIV negative,3,1,1,,,1,2,2,,Zimbabwe,Monthly,4,
138,HIV negative,1,1,2,2,3,1,2,2,2,SA,Monthly,,3
139,HIV negative,3,1,2,2,4,2,2,2,2,SA,Monthly,,4
140,HIV negative,2,1,2,1,4,1,2,2,2,SA,Monthly,,2
141,HIV negative,3,1,2,4,3,2,2,2,1,SA,Monthly,,2
142,HIV negative,3,1,2,4,5,1,2,2,1,SA,Monthly,,2
143,HIV negative,3,1,2,1,4,1,2,2,2,SA,Monthly,,2
144,HIV negative,3,1,2,3,3,2,2,2,1,SA,Monthly,,5
145,HIV negative,3,1,2,2,3,2,2,2,1,SA,Monthly,,2
146,HIV negative,3,1,1,4,0,1,2,2,2,Uganda,Monthly,6,
147,HIV negative,3,1,1,1,5,2,2,2,1,SA,Monthly,1,
148,HIV negative,3,1,2,3,3,2,2,2,1,SA,Monthly,,3
149,HIV negative,3,1,1,1,4,2,2,2,2,SA,Monthly,2,
150,HIV negative,3,1,1,1,3,1,2,2,2,SA,Monthly,1,
151,HIV negative,3,1,1,2,3,1,2,2,1,SA,Monthly,6,
152,HIV negative,3,1,1,4,0,1,2,2,2,SA,Monthly,1,
153,HIV negative,3,1,1,2,5,1,2,2,1,SA,Monthly,1,
154,HIV negative,3,1,1,3,1,2,2,2,2,SA,Monthly,2,
155,HIV negative,3,1,2,4,4,2,2,2,1,SA,Monthly,,2
156,HIV negative,3,1,2,2,5,2,2,2,1,Zimbabwe,Monthly,,2
157,HIV negative,3,1,1,4,3,1,2,2,2,Zimbabwe,Monthly,1,
158,HIV negative,3,1,1,4,0,1,2,2,1,Zimbabwe,Monthly,2,
159,HIV negative,3,1,1,4,5,2,2,2,1,Zimbabwe,Monthly,1,
160,HIV negative,3,1,1,1,4,2,2,2,2,Zimbabwe,Monthly,3,
161,HIV negative,3,1,2,1,3,2,2,2,1,Zimbabwe,Monthly,,2
162,HIV negative,2,1,1,4,5,2,2,2,1,Zimbabwe,Monthly,1,
163,HIV negative,2,1,1,,,2,2,2,,Zimbabwe,Monthly,1,
164,HIV negative,3,1,1,4,3,1,1,2,2,SA,Monthly,1,
165,HIV negative,3,1,2,2,3,2,1,1,1,SA,Monthly,,2
166,HIV negative,3,1,1,4,4,1,1,2,1,Uganda,Monthly,999,
167,HIV negative,3,1,1,4,5,1,1,2,2,Uganda,Monthly,999,
168,HIV negative,3,1,1,2,0,1,1,2,1,Uganda,Monthly,6,
169,HIV negative,2,1,1,4,0,1,1,2,1,Uganda,Monthly,1,
170,HIV negative,3,1,2,1,3,2,1,1,2,Uganda,Monthly,,4
171,HIV negative,3,1,1,3,5,2,1,2,2,SA,Monthly,2,
172,HIV negative,3,1,1,3,0,1,1,2,1,SA,Monthly,3,
173,HIV negative,3,1,1,1,4,2,1,2,2,Zimbabwe,Monthly,3,
174,HIV negative,3,1,1,1,4,2,1,2,1,Zimbabwe,Monthly,3,
175,HIV negative,3,1,1,3,4,2,1,2,2,Zimbabwe,Monthly,3,
176,HIV negative,3,1,1,4,3,2,1,2,1,Zimbabwe,Monthly,1,
177,HIV negative,3,1,2,3,5,1,0,1,2,SA,Monthly,,2
178,HIV negative,3,1,1,2,5,2,0,1,2,Uganda,Monthly,999,
179,HIV negative,3,1,2,1,3,2,0,1,1,Uganda,Monthly,,1
180,HIV negative,3,1,1,2,4,1,0,1,2,Zimbabwe,Monthly,2,
181,HIV negative,3,1,1,4,0,2,2,2,2,Uganda,Never,5,
182,HIV negative,1,1,2,3,5,1,2,2,1,SA,Never,,3
183,HIV negative,3,1,2,4,5,2,2,2,2,Uganda,Never,,2
184,HIV negative,3,1,1,1,5,1,2,2,1,Uganda,Never,1,
185,HIV negative,3,1,2,1,0,2,2,2,1,SA,Never,,4
186,HIV negative,2,1,2,,,1,2,2,,Zimbabwe,Never,,2
187,HIV negative,2,1,2,2,4,1,2,2,2,SA,Never,,2
188,HIV negative,3,1,2,3,4,1,2,2,2,SA,Never,,2
189,HIV negative,3,1,2,4,0,1,2,2,1,Zimbabwe,Never,,5
190,HIV negative,2,1,1,,,1,2,2,,Zimbabwe,Never,2,
191,HIV negative,3,1,2,4,998,2,2,2,1,SA,Never,,2
192,HIV negative,3,1,1,1,3,1,2,2,1,SA,Never,2,
193,HIV negative,3,1,1,2,3,2,2,2,2,Uganda,Never,999,
194,HIV negative,3,1,2,1,0,1,2,2,1,Uganda,Never,,2
195,HIV negative,3,1,1,4,0,2,2,2,2,SA,Never,1,
196,HIV negative,3,1,1,4,3,2,2,2,1,SA,Never,1,
197,HIV negative,3,1,1,2,4,2,2,2,2,SA,Never,3,
198,HIV negative,3,1,1,4,4,1,2,2,2,Zimbabwe,Never,2,
199,HIV negative,3,1,1,4,5,2,2,2,1,Zimbabwe,Never,5,
200,HIV negative,3,1,1,4,0,2,2,2,2,Zimbabwe,Never,1,
201,HIV negative,3,1,1,2,4,2,2,2,2,Zimbabwe,Never,5,
202,HIV negative,2,1,1,,,1,2,2,,Zimbabwe,Never,3,
203,HIV negative,2,1,1,1,5,1,2,2,1,SA,Never,2,
204,HIV negative,2,1,2,4,5,1,2,2,1,SA,Never,,2
205,HIV negative,3,1,1,2,0,1,2,2,1,SA,Never,1,
206,HIV negative,1,1,1,1,4,1,2,2,1,SA,Never,2,
207,HIV negative,3,1,2,1,4,1,2,2,1,SA,Never,,1
208,HIV negative,3,1,1,4,0,2,2,2,1,Uganda,Never,2,
209,HIV negative,3,1,1,,,1,2,2,,Uganda,Never,1,
210,HIV negative,3,1,2,4,4,2,2,2,1,Uganda,Never,,1
211,HIV negative,3,1,1,2,3,2,2,2,1,SA,Never,1,
212,HIV negative,3,1,1,3,4,1,2,2,2,SA,Never,1,
213,HIV negative,3,1,2,4,4,1,2,2,1,SA,Never,,2
214,HIV negative,3,1,2,1,0,1,2,2,1,SA,Never,,2
215,HIV negative,3,1,2,1,3,2,2,2,1,SA,Never,,5
216,HIV negative,3,1,2,2,3,2,2,2,1,SA,Never,,4
217,HIV negative,3,1,2,2,3,1,2,2,1,SA,Never,,4
218,HIV negative,3,1,2,1,5,2,2,2,1,Zimbabwe,Never,,2
219,HIV negative,3,1,1,4,0,1,2,2,1,Zimbabwe,Never,1,
220,HIV negative,1,1,2,,,1,2,2,,Zimbabwe,Never,,1
221,HIV negative,2,1,1,4,5,1,2,2,2,SA,Never,3,
222,HIV negative,3,1,2,2,3,2,2,2,1,SA,Never,,2
223,HIV negative,1,1,2,1,1,1,2,2,1,SA,Never,,4
224,HIV negative,1,1,2,4,5,1,2,2,1,SA,Never,,3
225,HIV negative,3,1,1,4,3,2,2,2,2,Uganda,Never,2,
226,HIV negative,2,1,2,,,1,2,2,,Uganda,Never,,3
227,HIV negative,3,1,1,3,0,2,2,2,1,Uganda,Never,1,
228,HIV negative,2,1,1,,,1,2,2,,Uganda,Never,1,
229,HIV negative,3,1,1,1,0,2,2,2,1,Uganda,Never,3,
230,HIV negative,2,1,2,2,4,2,2,2,1,Uganda,Never,,4
231,HIV negative,3,1,1,4,4,2,2,2,2,SA,Never,1,
232,HIV negative,3,1,1,1,3,1,2,2,1,SA,Never,4,
233,HIV negative,1,1,1,2,5,1,2,2,1,SA,Never,4,
234,HIV negative,3,1,1,1,0,2,2,2,2,Zimbabwe,Never,5,
235,HIV negative,2,1,1,2,4,2,2,2,2,Zimbabwe,Never,1,
236,HIV negative,3,1,2,1,5,2,2,2,2,Zimbabwe,Never,,4
237,HIV negative,3,1,2,2,3,1,1,2,2,SA,Never,,2
238,HIV negative,3,1,2,4,0,1,1,2,2,SA,Never,,3
239,HIV negative,3,1,2,2,0,1,1,2,2,SA,Never,,5
240,HIV negative,2,1,2,1,3,1,1,2,1,SA,Never,,1
241,HIV negative,3,1,1,,,1,1,2,,Uganda,Never,4,
242,HIV negative,3,1,1,1,4,2,1,1,1,Uganda,Never,3,
243,HIV negative,3,1,1,,,1,1,2,,Uganda,Never,999,
244,HIV negative,3,1,1,1,0,2,1,1,2,Uganda,Never,3,
245,HIV negative,3,1,2,2,5,2,1,2,1,Uganda,Never,,3
246,HIV negative,3,1,1,1,0,2,1,1,2,Uganda,Never,1,
247,HIV negative,3,1,1,3,0,2,1,2,2,Uganda,Never,1,
248,HIV negative,3,1,1,1,0,2,1,1,1,Uganda,Never,3,
249,HIV negative,3,1,1,,,1,1,2,,Uganda,Never,1,
250,HIV negative,3,1,1,1,3,2,1,1,2,Uganda,Never,2,
251,HIV negative,3,1,2,1,3,2,1,1,2,Uganda,Never,,5
252,HIV negative,3,1,1,1,0,1,1,2,1,Uganda,Never,1,
253,HIV negative,3,1,1,,,1,1,2,,Uganda,Never,4,
254,HIV negative,3,1,1,,,1,1,2,,Uganda,Never,4,
255,HIV negative,3,1,1,1,3,2,1,1,2,Uganda,Never,3,
256,HIV negative,3,1,2,2,5,1,1,2,1,Zimbabwe,Never,,2
257,HIV negative,3,1,2,2,5,1,1,2,1,Zimbabwe,Never,,4
258,HIV negative,3,1,1,4,888,2,0,1,2,Uganda,Never,999,
259,HIV negative,2,1,1,4,0,2,0,1,1,Uganda,Never,999,
260,HIV negative,3,1,1,1,5,2,0,1,2,Uganda,Never,4,
261,HIV negative,3,1,1,3,5,2,0,1,2,Uganda,Never,4,
262,HIV negative,3,1,1,2,0,2,0,1,2,Uganda,Never,2,
263,HIV negative,3,1,1,4,3,2,0,1,2,Uganda,Never,1,
264,HIV negative,3,1,1,2,0,2,0,1,1,Uganda,Never,1,
265,HIV negative,3,1,1,3,0,2,0,1,2,Uganda,Never,4,
266,HIV negative,3,1,1,3,0,2,0,1,1,Uganda,Never,5,
267,HIV negative,3,1,1,2,5,2,0,1,1,Uganda,Never,1,
268,HIV negative,3,1,1,4,0,2,0,1,2,Uganda,Never,2,
269,HIV negative,3,1,1,4,0,2,0,1,2,Uganda,Never,999,
270,HIV negative,3,1,2,1,0,2,0,1,1,Uganda,Never,,2
271,HIV negative,1,1,1,1,4,2,0,2,2,Uganda,Never,4,
272,HIV negative,3,1,1,1,0,2,0,1,1,Uganda,Never,1,
273,HIV negative,3,1,1,1,3,1,0,1,2,SA,Never,1,
274,HIV negative,3,1,2,1,4,2,0,1,1,SA,Never,,2
275,HIV negative,3,1,1,1,3,1,2,2,2,SA,Weekly,1,
276,HIV negative,3,1,2,4,3,2,2,2,1,SA,Weekly,,2
277,HIV negative,3,1,1,2,3,2,2,2,2,SA,Weekly,1,
278,HIV negative,3,1,2,2,4,1,2,2,2,SA,Weekly,,2
279,HIV negative,3,1,1,2,3,1,2,2,1,SA,Weekly,1,
280,HIV negative,2,1,1,4,4,1,2,2,2,SA,Weekly,997,
281,HIV negative,3,1,1,1,4,2,2,2,2,SA,Weekly,1,
282,HIV negative,3,1,1,1,0,2,2,2,1,Zimbabwe,Weekly,6,
283,HIV negative,3,1,1,1,0,1,2,2,2,SA,Weekly,2,
284,HIV negative,3,1,1,1,0,1,2,2,2,Zimbabwe,Weekly,3,
285,HIV negative,3,1,1,4,0,2,2,2,2,Zimbabwe,Weekly,1,
286,HIV negative,3,1,1,2,4,2,2,2,1,Zimbabwe,Weekly,999,
287,HIV negative,3,1,1,2,4,1,2,2,1,Zimbabwe,Weekly,1,
288,HIV negative,1,1,2,1,888,1,2,2,2,SA,Weekly,,2
289,HIV negative,3,1,2,1,2,1,2,2,1,SA,Weekly,,2
290,HIV negative,3,1,1,3,5,2,2,1,2,Uganda,Weekly,4,
291,HIV negative,3,1,2,3,4,2,2,2,2,SA,Weekly,,2
292,HIV negative,3,1,1,2,4,1,2,2,1,Zimbabwe,Weekly,1,
293,HIV negative,3,1,1,2,4,2,2,2,1,Zimbabwe,Weekly,5,
294,HIV negative,3,1,1,1,3,2,2,2,2,Zimbabwe,Weekly,3,
295,HIV negative,3,1,2,1,3,2,2,2,2,SA,Weekly,,2
296,HIV negative,3,1,2,1,4,2,2,2,2,SA,Weekly,,1
297,HIV negative,3,1,2,2,3,2,2,2,1,SA,Weekly,,5
298,HIV negative,3,1,2,4,888,2,2,2,2,SA,Weekly,,5
299,HIV negative,3,1,2,2,4,2,2,2,2,SA,Weekly,,4
300,HIV negative,3,1,1,1,3,1,2,2,1,SA,Weekly,1,
301,HIV negative,3,1,1,3,4,1,2,2,1,SA,Weekly,1,
302,HIV negative,3,1,2,4,3,1,2,2,2,SA,Weekly,,2
303,HIV negative,3,1,2,1,4,2,2,2,1,SA,Weekly,,4
304,HIV negative,3,1,1,3,3,2,2,2,2,SA,Weekly,2,
305,HIV negative,2,1,1,4,888,1,2,2,1,SA,Weekly,1,
306,HIV negative,1,1,2,,,1,2,2,,Zimbabwe,Weekly,,2
307,HIV negative,3,1,1,4,5,2,2,2,1,Zimbabwe,Weekly,2,
308,HIV negative,3,1,2,2,2,1,2,2,1,Zimbabwe,Weekly,,2
309,HIV negative,3,1,2,1,4,2,2,2,1,Zimbabwe,Weekly,,2
310,HIV negative,3,1,2,4,888,2,2,2,1,SA,Weekly,,2
311,HIV negative,3,1,2,1,4,2,2,2,2,SA,Weekly,,1
312,HIV negative,3,1,2,4,998,2,2,2,1,SA,Weekly,,5
313,HIV negative,3,1,1,1,5,2,2,1,2,Uganda,Weekly,999,
314,HIV negative,3,1,2,1,3,1,2,2,1,SA,Weekly,,2
315,HIV negative,3,1,2,1,3,1,2,2,1,SA,Weekly,,3
316,HIV negative,3,1,2,2,3,2,2,2,2,SA,Weekly,,1
317,HIV negative,3,1,2,1,4,2,2,2,1,SA,Weekly,,1
318,HIV negative,3,1,1,4,3,2,2,1,2,Zimbabwe,Weekly,1,
319,HIV negative,3,1,1,2,5,2,2,2,1,Zimbabwe,Weekly,2,
320,HIV negative,3,1,1,1,3,1,1,2,2,SA,Weekly,6,
321,HIV negative,2,1,1,2,0,1,1,2,2,SA,Weekly,1,
322,HIV negative,3,1,1,4,0,2,1,1,2,Uganda,Weekly,2,
323,HIV negative,3,1,1,4,3,2,1,1,2,Uganda,Weekly,2,
324,HIV negative,2,1,2,4,0,1,1,2,2,Uganda,Weekly,,3
325,HIV negative,3,1,1,3,3,2,1,1,2,Uganda,Weekly,999,
326,HIV negative,3,1,1,2,4,2,1,1,2,Zimbabwe,Weekly,6,
327,HIV negative,3,1,1,2,3,2,1,1,2,Zimbabwe,Weekly,2,
328,HIV negative,3,1,1,4,5,1,0,1,2,Uganda,Weekly,4,
329,HIV negative,3,1,1,3,888,2,0,1,2,Uganda,Weekly,999,
330,HIV negative,3,1,1,4,3,2,0,1,2,Uganda,Weekly,999,
331,HIV negative,3,1,1,1,4,2,0,1,2,Uganda,Weekly,1,
332,HIV negative,3,1,1,3,3,2,0,1,2,Zimbabwe,Weekly,4,
333,HIV negative,3,1,1,1,0,2,0,1,1,Zimbabwe,Weekly,1,
334,HIV negative,1,1,2,1,4,1,2,2,1,SA,,,3
335,HIV negative,2,1,1,,,2,2,2,,Uganda,,1,
336,HIV negative,2,1,2,2,4,1,2,2,1,SA,,,2
337,HIV negative,1,1,1,,,1,2,2,,Uganda,,1,
338,HIV negative,2,1,2,,,1,2,2,,Zimbabwe,,,2
339,HIV negative,3,1,1,4,5,1,2,2,1,Uganda,,2,
340,HIV negative,3,1,2,4,0,1,2,2,1,Uganda,,,2
341,HIV negative,2,1,1,,,1,2,2,,Uganda,,999,
342,HIV negative,3,1,2,4,0,1,2,2,1,Uganda,,,2
343,HIV negative,3,1,1,4,0,1,2,2,1,Uganda,,1,
344,HIV negative,3,1,1,1,0,1,2,2,1,Zimbabwe,,4,
345,HIV negative,1,1,2,,,1,2,2,,Zimbabwe,,,2
346,HIV negative,3,1,2,1,4,1,2,2,1,Zimbabwe,,,2
347,HIV negative,2,1,2,1,0,2,2,2,2,Zimbabwe,,,2
348,HIV negative,1,1,2,,,1,2,2,,Zimbabwe,,,4
349,HIV negative,2,1,2,,,1,2,2,,Zimbabwe,,,1
350,HIV negative,3,1,1,1,0,1,2,2,2,Uganda,,1,
351,HIV negative,3,1,1,3,888,1,2,2,1,Uganda,,1,
352,HIV negative,3,1,1,2,5,1,2,2,2,Uganda,,1,
353,HIV negative,1,1,1,,,1,2,2,,Uganda,,999,
354,HIV negative,1,1,2,2,5,1,2,2,1,SA,,,2
355,HIV negative,3,1,2,1,4,2,2,2,2,Zimbabwe,,,4
356,HIV negative,1,1,1,,,1,2,2,,Zimbabwe,,4,
357,HIV negative,3,1,2,2,0,2,2,2,1,Zimbabwe,,,5
358,HIV negative,2,1,1,2,5,2,2,2,1,Zimbabwe,,5,
359,HIV negative,3,1,1,2,0,2,2,2,2,Zimbabwe,,2,
360,HIV negative,2,1,1,,,2,2,2,,Zimbabwe,,4,
361,HIV negative,2,1,1,4,0,1,2,2,1,SA,,2,
362,HIV negative,3,1,2,2,5,2,2,2,1,SA,,,2
363,HIV negative,3,1,2,2,888,2,2,2,1,SA,,,5
364,HIV negative,3,1,2,1,3,2,2,2,2,SA,,,2
365,HIV negative,2,1,1,1,3,1,2,2,1,SA,,1,
366,HIV negative,1,1,1,,,1,2,2,,Uganda,,2,
367,HIV negative,3,1,1,4,5,2,2,2,2,Uganda,,2,
368,HIV negative,2,1,1,,,1,2,2,,Uganda,,3,
369,HIV negative,2,1,1,4,0,2,2,2,2,Uganda,,2,
370,HIV negative,2,1,1,,,1,2,2,,Uganda,,2,
371,HIV negative,3,1,1,4,0,2,2,2,2,Uganda,,999,
372,HIV negative,1,1,2,,,1,2,2,,Uganda,,,3
373,HIV negative,2,1,1,1,0,1,2,2,2,Uganda,,4,
374,HIV negative,3,1,1,,,1,2,2,,Uganda,,999,
375,HIV negative,3,1,1,3,0,2,2,2,1,Uganda,,6,
376,HIV negative,1,1,2,,,1,2,2,,Uganda,,,3
377,HIV negative,1,1,1,,,1,2,2,,Uganda,,4,
378,HIV negative,3,1,1,2,5,2,2,2,1,SA,,1,
379,HIV negative,3,1,2,,,1,2,2,,Zimbabwe,,,2
380,HIV negative,3,1,1,,,1,2,2,,Zimbabwe,,1,
381,HIV negative,3,1,1,,,1,2,2,,Zimbabwe,,1,
382,HIV negative,2,1,1,1,5,1,2,2,1,Zimbabwe,,5,
383,HIV negative,3,1,1,4,5,2,2,2,1,Zimbabwe,,1,
384,HIV negative,3,1,1,4,5,2,2,2,1,Zimbabwe,,1,
385,HIV negative,2,1,2,1,4,2,2,2,1,Zimbabwe,,,5
386,HIV negative,3,1,1,1,0,1,2,2,2,Zimbabwe,,6,
387,HIV negative,3,1,1,,,1,2,2,,Zimbabwe,,1,
388,HIV negative,2,1,2,1,5,2,2,2,1,Zimbabwe,,,5
389,HIV negative,2,1,1,1,0,1,2,2,2,Zimbabwe,,1,
390,HIV negative,3,1,1,3,0,1,2,2,1,Zimbabwe,,4,
391,HIV negative,1,1,1,1,5,1,2,2,1,SA,,1,
392,HIV negative,2,1,1,,,1,2,2,,Uganda,,4,
393,HIV negative,3,1,1,2,5,1,2,2,2,Uganda,,4,
394,HIV negative,2,1,1,4,0,1,2,2,1,Uganda,,2,
395,HIV negative,3,1,1,,,1,2,2,,Uganda,,4,
396,HIV negative,1,1,1,,,1,2,2,,Uganda,,1,
397,HIV negative,3,1,1,,,1,2,2,,Uganda,,999,
398,HIV negative,3,1,1,,,2,2,2,,Uganda,,6,
399,HIV negative,3,1,1,4,0,1,2,2,2,Uganda,,1,
400,HIV negative,3,1,2,,,1,2,2,,Uganda,,,2
401,HIV negative,1,1,2,,,1,2,2,,Uganda,,,2
402,HIV negative,2,1,1,2,0,2,2,2,2,Uganda,,2,
403,HIV negative,3,1,1,4,0,1,2,2,1,Uganda,,999,
404,HIV negative,3,1,1,,,1,2,2,,Uganda,,1,
405,HIV negative,3,1,1,4,0,2,2,2,1,Uganda,,4,
406,HIV negative,1,1,2,,,1,2,2,,Uganda,,,5
407,HIV negative,1,1,2,,,1,2,2,,Uganda,,,3
408,HIV negative,3,1,2,,,1,2,2,,Uganda,,,5
409,HIV negative,3,1,1,1,0,1,2,2,1,Uganda,,2,
410,HIV negative,3,1,1,,,1,2,2,,Uganda,,3,
411,HIV negative,1,1,2,,,1,2,2,,Uganda,,,5
412,HIV negative,2,1,1,,,1,2,2,,Uganda,,1,
413,HIV negative,1,1,1,,,1,2,2,,Uganda,,2,
414,HIV negative,1,1,2,3,5,1,2,2,1,SA,,,6
415,HIV negative,1,1,2,2,5,1,2,2,1,SA,,,2
416,HIV negative,2,1,1,1,0,1,2,1,2,Zimbabwe,,1,
417,HIV negative,3,1,1,1,5,2,2,2,1,Zimbabwe,,5,
418,HIV negative,3,1,1,2,0,2,2,2,1,Zimbabwe,,3,
419,HIV negative,3,1,2,,,2,2,2,,Zimbabwe,,,4
420,HIV negative,3,1,1,4,4,1,2,2,2,Zimbabwe,,4,
421,HIV negative,3,1,2,4,0,2,2,2,1,Zimbabwe,,,2
422,HIV negative,3,1,2,1,3,2,2,2,1,Zimbabwe,,,2
423,HIV negative,3,1,1,4,0,1,2,2,1,Zimbabwe,,6,
424,HIV negative,3,1,1,,,2,2,2,,Zimbabwe,,4,
425,HIV negative,2,1,2,,,2,2,2,,Zimbabwe,,,2
426,HIV negative,3,1,2,2,4,2,2,2,1,Zimbabwe,,,3
427,HIV negative,3,1,1,3,3,1,2,2,2,Zimbabwe,,1,
428,HIV negative,3,1,1,2,4,1,2,2,1,Zimbabwe,,2,
429,HIV negative,1,1,2,,,1,2,2,,Zimbabwe,,,2
430,HIV negative,1,1,2,,,1,2,2,,Zimbabwe,,,2
431,HIV negative,2,1,2,4,5,1,2,2,1,Zimbabwe,,,5
432,HIV negative,3,1,1,4,5,2,2,2,1,Zimbabwe,,4,
433,HIV negative,3,1,1,1,0,1,2,2,2,Zimbabwe,,1,
434,HIV negative,3,1,1,1,0,2,2,2,2,Zimbabwe,,4,
435,HIV negative,3,1,2,4,0,2,2,2,1,Zimbabwe,,,2
436,HIV negative,3,1,1,1,0,1,2,2,1,Zimbabwe,,4,
437,HIV negative,3,1,2,4,1,1,2,2,1,Zimbabwe,,,2
438,HIV negative,2,1,1,1,0,2,2,2,1,Zimbabwe,,1,
439,HIV negative,2,1,1,1,0,1,2,2,1,Zimbabwe,,1,
440,HIV negative,3,1,2,4,5,2,2,2,1,Zimbabwe,,,5
441,HIV negative,3,1,2,1,5,2,2,2,1,Zimbabwe,,,2
442,HIV negative,3,1,1,2,0,2,2,2,1,Zimbabwe,,1,
443,HIV negative,1,1,2,,,1,2,2,,Zimbabwe,,,3
444,HIV negative,2,1,1,1,0,1,2,2,2,Zimbabwe,,2,
445,HIV negative,1,1,2,,,1,2,2,,Zimbabwe,,,2