dhl,degree,vi_status,heartest_time,duration_q,hour_q_duration,min_q_duration,sec_q_duration,duration_e,hour_e_duration,min_e_duration,sec_e_duration,duration_v,hour_v_duration,min_v_duration,sec_v_duration,chart,total_time,total_time_consent,total_time_consent7,total_time_v,total_time_v_consent7
0,0,,7.5166669,00:02:00,0,2,0,00:03:00,0,3,0,,,,,,12.516666,27.516666,19.516666,12.516666,19.516666
0,1,,9.6166668,00:02:00,0,2,0,00:07:00,0,7,0,,,,,,18.616667,33.616669,25.616667,18.616667,25.616667
0,0,,6.3000002,00:01:00,0,1,0,00:05:00,0,5,0,,,,,,12.3,27.299999,19.299999,12.3,19.299999
0,1,,7.6166668,00:01:00,0,1,0,00:07:00,0,7,0,,,,,,15.616667,30.616667,22.616667,15.616667,22.616667
0,0,,7.0500002,00:01:00,0,1,0,00:08:00,0,8,0,,,,,,16.049999,31.049999,23.049999,16.049999,23.049999
0,0,,7.1833334,00:03:00,0,3,0,00:04:00,0,4,0,,,,,,14.183333,29.183334,21.183334,14.183333,21.183334
0,0,,7.0999999,00:03:00,0,3,0,00:04:00,0,4,0,,,,,,14.1,29.1,21.1,14.1,21.1
0,1,,8.8000002,00:02:00,0,2,0,00:05:00,0,5,0,,,,,,15.8,30.799999,22.799999,15.8,22.799999
0,1,,5.9166665,00:02:00,0,2,0,00:05:00,0,5,0,,,,,,12.916666,27.916666,19.916666,12.916666,19.916666
0,1,,7.9666667,00:03:00,0,3,0,00:12:00,0,12,0,,,,,,22.966667,37.966667,29.966667,22.966667,29.966667
0,0,,7.4833331,00:01:00,0,1,0,00:11:00,0,11,0,,,,,,19.483334,34.483334,26.483334,19.483334,26.483334
0,0,,8.6166668,00:02:00,0,2,0,00:04:00,0,4,0,,,,,,14.616667,29.616667,21.616667,14.616667,21.616667
0,0,,5.5500002,00:03:00,0,3,0,00:06:00,0,6,0,,,,,,14.55,29.549999,21.549999,14.55,21.549999
0,,,,00:01:00,0,1,0,,,,,,,,,,,,,,
0,1,,7.3333335,00:03:00,0,3,0,00:06:00,0,6,0,,,,,,16.333334,31.333334,23.333334,16.333334,23.333334
0,0,,7.6999998,00:03:00,0,3,0,00:05:00,0,5,0,,,,,,15.7,30.700001,22.700001,15.7,22.700001
1,3,,11.416667,00:03:00,0,3,0,00:18:00,0,18,0,,,,,,32.416668,47.416668,39.416668,32.416668,39.416668
0,1,,7,00:03:00,0,3,0,00:06:00,0,6,0,,,,,,16,31,23,16,23
0,0,,5.6999998,00:02:00,0,2,0,00:15:00,0,15,0,,,,,,22.700001,37.700001,29.700001,22.700001,29.700001
0,1,,7.1999998,00:02:00,0,2,0,00:05:00,0,5,0,,,,,,14.2,29.200001,21.200001,14.2,21.200001
0,0,,8.3166666,00:01:00,0,1,0,00:05:00,0,5,0,,,,,,14.316667,29.316666,21.316666,14.316667,21.316666
0,1,,6.6666665,00:05:00,0,5,0,00:05:00,0,5,0,,,,,,16.666666,31.666666,23.666666,16.666666,23.666666
0,0,,7.75,00:04:00,0,4,0,00:06:00,0,6,0,,,,,,17.75,32.75,24.75,17.75,24.75
0,0,,7.9666667,00:02:00,0,2,0,00:06:00,0,6,0,,,,,,15.966667,30.966667,22.966667,15.966667,22.966667
0,1,,8.75,00:04:00,0,4,0,00:22:00,0,22,0,,,,,,34.75,49.75,41.75,34.75,41.75
0,1,,8.7666664,00:03:00,0,3,0,00:05:00,0,5,0,,,,,,16.766666,31.766666,23.766666,16.766666,23.766666
0,0,,7.4666667,00:02:00,0,2,0,00:06:00,0,6,0,,,,,,15.466667,30.466667,22.466667,15.466667,22.466667
0,0,,8.1833334,00:04:00,0,4,0,00:06:00,0,6,0,,,,,,18.183334,33.183334,25.183334,18.183334,25.183334
0,1,,9.2333336,00:02:00,0,2,0,00:06:00,0,6,0,,,,,,17.233334,32.233334,24.233334,17.233334,24.233334
0,0,,3.5333333,00:02:00,0,2,0,00:05:00,0,5,0,,,,,,10.533333,25.533333,17.533333,10.533333,17.533333
0,1,,7.1500001,00:02:00,0,2,0,00:08:00,0,8,0,,,,,,17.15,32.150002,24.15,17.15,24.15
0,1,,7.8333335,00:02:00,0,2,0,00:07:00,0,7,0,,,,,,16.833334,31.833334,23.833334,16.833334,23.833334
0,,,,00:01:00,0,1,0,,,,,,,,,,,,,,
0,0,,7.1500001,00:02:00,0,2,0,00:05:00,0,5,0,,,,,,14.15,29.15,21.15,14.15,21.15
0,,,,00:02:00,0,2,0,,,,,,,,,,,,,,
0,1,,7.3666668,00:01:00,0,1,0,00:05:00,0,5,0,,,,,,13.366667,28.366667,20.366667,13.366667,20.366667
0,0,,7.2333331,00:00:00,0,,0,00:08:00,0,8,0,,,,,,,,,,
0,0,,7.8666668,00:03:00,0,3,0,00:05:00,0,5,0,,,,,,15.866667,30.866667,22.866667,15.866667,22.866667
0,,,,00:01:00,0,1,0,,,,,,,,,,,,,,
0,1,,11.516666,00:05:00,0,5,0,00:05:00,0,5,0,,,,,,21.516666,36.516666,28.516666,21.516666,28.516666
0,0,,7.3666668,00:03:00,0,3,0,00:05:00,0,5,0,,,,,,15.366667,30.366667,22.366667,15.366667,22.366667
0,0,,6.9000001,00:03:00,0,3,0,00:03:00,0,3,0,,,,,,12.9,27.9,19.9,12.9,19.9
0,0,,6.6666665,00:02:00,0,2,0,00:12:00,0,12,0,,,,,,20.666666,35.666664,27.666666,20.666666,27.666666
0,0,,5.8000002,00:02:00,0,2,0,00:04:00,0,4,0,,,,,,11.8,26.799999,18.799999,11.8,18.799999
0,1,,7.9000001,00:03:00,0,3,0,00:18:00,0,18,0,,,,,,28.9,43.900002,35.900002,28.9,35.900002
0,0,,5.6833334,00:02:00,0,2,0,00:05:00,0,5,0,,,,,,12.683333,27.683334,19.683334,12.683333,19.683334
0,0,,6.8833332,00:02:00,0,2,0,00:05:00,0,5,0,,,,,,13.883333,28.883333,20.883333,13.883333,20.883333
0,0,,9.3666668,00:03:00,0,3,0,00:07:00,0,7,0,,,,,,19.366667,34.366669,26.366667,19.366667,26.366667
0,1,,7.8666668,00:02:00,0,2,0,00:06:00,0,6,0,,,,,,15.866667,30.866667,22.866667,15.866667,22.866667
0,,,,00:02:00,0,2,0,,,,,,,,,,,,,,
0,1,,7.7833333,00:02:00,0,2,0,00:06:00,0,6,0,,,,,,15.783333,30.783333,22.783333,15.783333,22.783333
0,0,,8.1166668,00:01:00,0,1,0,00:11:00,0,11,0,,,,,,20.116667,35.116669,27.116667,20.116667,27.116667
0,0,,6.6666665,00:02:00,0,2,0,00:07:00,0,7,0,,,,,,15.666666,30.666666,22.666666,15.666666,22.666666
0,1,,7.0333333,00:02:00,0,2,0,00:09:00,0,9,0,,,,,,18.033333,33.033333,25.033333,18.033333,25.033333
0,0,,5.8499999,00:02:00,0,2,0,00:05:00,0,5,0,,,,,,12.85,27.85,19.85,12.85,19.85
0,0,,9.9333334,00:02:00,0,2,0,00:07:00,0,7,0,,,,,,18.933334,33.933334,25.933334,18.933334,25.933334
0,1,,8.0500002,00:02:00,0,2,0,00:05:00,0,5,0,,,,,,15.05,30.049999,22.049999,15.05,22.049999
0,0,,9.1999998,00:02:00,0,2,0,00:13:00,0,13,0,,,,,,24.200001,39.200001,31.200001,24.200001,31.200001
0,0,,6.9166665,00:01:00,0,1,0,00:05:00,0,5,0,,,,,,12.916666,27.916666,19.916666,12.916666,19.916666
0,1,,14.8,00:03:00,0,3,0,00:07:00,0,7,0,,,,,,24.799999,39.799999,31.799999,24.799999,31.799999
0,0,,6.6666665,00:02:00,0,2,0,00:11:00,0,11,0,,,,,,19.666666,34.666664,26.666666,19.666666,26.666666
0,,,,00:02:00,0,2,0,00:07:00,0,7,0,,,,,,,,,,
0,0,,7.6999998,00:01:00,0,1,0,00:05:00,0,5,0,,,,,,13.7,28.700001,20.700001,13.7,20.700001
0,0,,5.5833335,00:03:00,0,3,0,00:04:00,0,4,0,,,,,,12.583334,27.583334,19.583334,12.583334,19.583334
1,4,,10,00:02:00,0,2,0,00:10:00,0,10,0,,,,,,22,37,29,22,29
0,,,,00:03:00,0,3,0,,,,,,,,,,,,,,
0,0,,6.4833331,00:02:00,0,2,0,00:05:00,0,5,0,,,,,,13.483334,28.483334,20.483334,13.483334,20.483334
0,0,,7.4000001,00:02:00,0,2,0,00:13:00,0,13,0,,,,,,22.4,37.400002,29.4,22.4,29.4
0,0,,6.5833335,00:03:00,0,3,0,00:06:00,0,6,0,,,,,,15.583334,30.583334,22.583334,15.583334,22.583334
0,0,,6.1333332,00:02:00,0,2,0,00:04:00,0,4,0,,,,,,12.133333,27.133333,19.133333,12.133333,19.133333
0,0,,6.2333331,00:01:00,0,1,0,00:12:00,0,12,0,,,,,,19.233334,34.233334,26.233334,19.233334,26.233334
0,1,,7.7333331,00:05:00,0,5,0,00:11:00,0,11,0,,,,,,23.733334,38.733334,30.733334,23.733334,30.733334
0,0,,8.0666666,00:01:00,0,1,0,00:03:00,0,3,0,,,,,,12.066667,27.066666,19.066666,12.066667,19.066666
0,,,,00:01:00,0,1,0,,,,,,,,,,,,,,
0,0,,7.0666666,,2,,0,00:04:00,0,4,0,,,,,,,,,,
0,0,,6.5999999,00:02:00,0,2,0,00:07:00,0,7,0,,,,,,15.6,30.6,22.6,15.6,22.6
0,0,,6.4833331,00:04:00,0,4,0,00:06:00,0,6,0,,,,,,16.483334,31.483334,23.483334,16.483334,23.483334
0,0,,8.166667,00:01:00,0,1,0,00:05:00,0,5,0,,,,,,14.166667,29.166668,21.166668,14.166667,21.166668
1,4,,17.616667,00:02:00,0,2,0,00:07:00,0,7,0,,,,,,26.616667,41.616669,33.616669,26.616667,33.616669
0,0,,7.4666667,00:01:00,0,1,0,00:07:00,0,7,0,,,,,,15.466667,30.466667,22.466667,15.466667,22.466667
0,1,,7.7666669,00:02:00,0,2,0,00:07:00,0,7,0,,,,,,16.766666,31.766666,23.766666,16.766666,23.766666
0,0,,14.633333,00:02:00,0,2,0,00:12:00,0,12,0,,,,,,28.633333,43.633331,35.633331,28.633333,35.633331
0,,,,00:01:00,0,1,0,,,,,,,,,,,,,,
0,0,,7.0666666,00:01:00,0,1,0,00:05:00,0,5,0,,,,,,13.066667,28.066666,20.066666,13.066667,20.066666
0,0,,6.75,00:04:00,0,4,0,00:13:00,0,13,0,,,,,,23.75,38.75,30.75,23.75,30.75
0,0,,7.5666666,00:04:00,0,4,0,00:08:00,0,8,0,,,,,,19.566666,34.566666,26.566666,19.566666,26.566666
0,0,,7.8666668,00:01:00,0,1,0,00:06:00,0,6,0,,,,,,14.866667,29.866667,21.866667,14.866667,21.866667
0,1,,7.0666666,00:02:00,0,2,0,00:08:00,0,8,0,,,,,,17.066666,32.066666,24.066666,17.066666,24.066666
0,0,,9.2333336,00:02:00,0,2,0,00:07:00,0,7,0,,,,,,18.233334,33.233334,25.233334,18.233334,25.233334
1,3,,9,00:02:00,0,2,0,00:11:00,0,11,0,,,,,,22,37,29,22,29
0,0,,5.0333333,00:02:00,0,2,0,00:06:00,0,6,0,,,,,,13.033333,28.033333,20.033333,13.033333,20.033333
1,3,,6.7666669,00:02:00,0,2,0,00:06:00,0,6,0,,,,,,14.766666,29.766666,21.766666,14.766666,21.766666
0,0,,5.9333334,00:03:00,0,3,0,00:07:00,0,7,0,,,,,,15.933333,30.933334,22.933334,15.933333,22.933334
0,1,,6.3499999,00:03:00,0,3,0,00:05:00,0,5,0,,,,,,14.35,29.35,21.35,14.35,21.35
1,2,,8.3166666,00:04:00,0,4,0,00:05:00,0,5,0,,,,,,17.316666,32.316666,24.316666,17.316666,24.316666
0,0,,7.4499998,00:03:00,0,3,0,00:10:00,0,10,0,,,,,,20.450001,35.450001,27.450001,20.450001,27.450001
0,0,,6.8166666,00:01:00,0,1,0,00:07:00,0,7,0,,,,,,14.816667,29.816666,21.816666,14.816667,21.816666
0,0,,6.3000002,00:02:00,0,2,0,00:04:00,0,4,0,,,,,,12.3,27.299999,19.299999,12.3,19.299999
0,1,,7.1500001,00:02:00,0,2,0,00:07:00,0,7,0,,,,,,16.15,31.15,23.15,16.15,23.15
0,0,,7,00:02:00,0,2,0,00:06:00,0,6,0,,,,,,15,30,22,15,22
0,1,,7.7666669,00:02:00,0,2,0,00:08:00,0,8,0,,,,,,17.766666,32.766666,24.766666,17.766666,24.766666
0,1,,8.1333332,00:03:00,0,3,0,00:09:00,0,9,0,,,,,,20.133333,35.133331,27.133333,20.133333,27.133333
0,0,,7.2666669,00:04:00,0,4,0,00:05:00,0,5,0,,,,,,16.266666,31.266666,23.266666,16.266666,23.266666
0,0,,7.1999998,00:02:00,0,2,0,00:11:00,0,11,0,,,,,,20.200001,35.200001,27.200001,20.200001,27.200001
0,0,,6.6666665,00:04:00,0,4,0,00:06:00,0,6,0,,,,,,16.666666,31.666666,23.666666,16.666666,23.666666
0,0,,7.3833332,00:03:00,0,3,0,00:07:00,0,7,0,,,,,,17.383333,32.383331,24.383333,17.383333,24.383333
0,0,,7.9166665,00:03:00,0,3,0,00:05:00,0,5,0,,,,,,15.916666,30.916666,22.916666,15.916666,22.916666
0,0,,7.1500001,00:03:00,0,3,0,00:07:00,0,7,0,,,,,,17.15,32.150002,24.15,17.15,24.15
0,0,,9.583333,00:05:00,0,5,0,00:10:00,0,10,0,,,,,,24.583332,39.583332,31.583332,24.583332,31.583332
0,1,,7.0166669,00:02:00,0,2,0,00:13:00,0,13,0,,,,,,22.016666,37.016666,29.016666,22.016666,29.016666
1,3,,9.1999998,00:02:00,0,2,0,00:04:00,0,4,0,,,,,,15.2,30.200001,22.200001,15.2,22.200001
0,1,,7.5166669,00:01:00,0,1,0,00:07:00,0,7,0,,,,,,15.516666,30.516666,22.516666,15.516666,22.516666
0,,,,00:01:00,0,1,0,,,,,,,,,,,,,,
0,0,,13.1,00:03:00,0,3,0,00:05:00,0,5,0,,,,,,21.1,36.099998,28.1,21.1,28.1
0,1,,7.0333333,00:02:00,0,2,0,00:05:00,0,5,0,,,,,,14.033333,29.033333,21.033333,14.033333,21.033333
0,0,,7.1166668,00:01:00,0,1,0,00:14:00,0,14,0,,,,,,22.116667,37.116669,29.116667,22.116667,29.116667
0,0,,7,00:03:00,0,3,0,00:05:00,0,5,0,,,,,,15,30,22,15,22
0,1,,7.1666665,,1,,0,00:08:00,0,8,0,,,,,,,,,,
0,0,,7.7166667,00:02:00,0,2,0,00:07:00,0,7,0,,,,,,16.716667,31.716667,23.716667,16.716667,23.716667
0,0,,16.366667,00:06:00,0,6,0,00:20:00,0,20,0,,,,,,42.366669,57.366669,49.366669,42.366669,49.366669
0,1,,7.3000002,00:02:00,0,2,0,00:08:00,0,8,0,,,,,,17.299999,32.299999,24.299999,17.299999,24.299999
0,0,,7.0500002,00:02:00,0,2,0,00:18:00,0,18,0,,,,,,27.049999,42.049999,34.049999,27.049999,34.049999
0,0,,7.4833331,00:01:00,0,1,0,00:06:00,0,6,0,,,,,,14.483334,29.483334,21.483334,14.483334,21.483334
0,1,,10,00:01:00,0,1,0,00:11:00,0,11,0,,,,,,22,37,29,22,29
0,0,,6.7333331,00:02:00,0,2,0,00:05:00,0,5,0,,,,,,13.733334,28.733334,20.733334,13.733334,20.733334
0,0,,7.7666669,00:03:00,0,3,0,00:06:00,0,6,0,,,,,,16.766666,31.766666,23.766666,16.766666,23.766666
0,,,,00:01:00,0,1,0,,,,,,,,,,,,,,
0,0,,7.2166667,00:02:00,0,2,0,00:06:00,0,6,0,,,,,,15.216667,30.216667,22.216667,15.216667,22.216667
0,,,,00:02:00,0,2,0,,,,,,,,,,,,,,
0,0,,6.1999998,00:02:00,0,2,0,00:06:00,0,6,0,,,,,,14.2,29.200001,21.200001,14.2,21.200001
0,0,,6.8833332,00:04:00,0,4,0,00:06:00,0,6,0,,,,,,16.883333,31.883333,23.883333,16.883333,23.883333
0,0,,6.0333333,00:01:00,0,1,0,00:04:00,0,4,0,,,,,,11.033333,26.033333,18.033333,11.033333,18.033333
1,2,,9.25,00:03:00,0,3,0,00:10:00,0,10,0,,,,,,,,,,
0,0,,7.8666668,00:03:00,0,3,0,00:06:00,0,6,0,,,,,,16.866667,31.866667,23.866667,16.866667,23.866667
0,0,,6.5999999,00:03:00,0,3,0,00:13:00,0,13,0,,,,,,22.6,37.599998,29.6,22.6,29.6
0,0,,6.7333331,00:01:00,0,1,0,00:08:00,0,8,0,,,,,,15.733334,30.733334,22.733334,15.733334,22.733334
0,0,,6.9833331,00:03:00,0,3,0,00:04:00,0,4,0,,,,,,13.983334,28.983334,20.983334,13.983334,20.983334
0,0,,6.4333334,00:02:00,0,2,0,00:07:00,0,7,0,,,,,,15.433333,30.433334,22.433334,15.433333,22.433334
0,0,,7.8833332,00:03:00,0,3,0,00:11:00,0,11,0,,,,,,21.883333,36.883331,28.883333,21.883333,28.883333
0,0,,7.1833334,00:03:00,0,3,0,00:05:00,0,5,0,,,,,,15.183333,30.183334,22.183334,15.183333,22.183334
0,1,,8.583333,00:05:00,0,5,0,00:08:00,0,8,0,,,,,,21.583332,36.583332,28.583332,21.583332,28.583332
0,0,,6.4833331,00:03:00,0,3,0,00:28:00,0,28,0,,,,,,37.483334,52.483334,44.483334,37.483334,44.483334
0,0,,4.1500001,00:33:00,0,33,0,00:06:00,0,6,0,,,,,,43.150002,58.150002,50.150002,43.150002,50.150002
0,0,,5.4499998,00:02:00,0,2,0,00:05:00,0,5,0,,,,,,12.45,27.450001,19.450001,12.45,19.450001
0,0,,6.7666669,00:02:00,0,2,0,00:04:00,0,4,0,,,,,,12.766666,27.766666,19.766666,12.766666,19.766666
0,1,,7.4833331,00:03:00,0,3,0,00:15:00,0,15,0,,,,,,25.483334,40.483334,32.483334,25.483334,32.483334
1,4,,,00:02:00,0,2,0,00:11:00,0,11,0,,,,,,,,,,
0,1,,6.8333335,00:01:00,0,1,0,00:10:00,0,10,0,,,,,,17.833334,32.833336,24.833334,17.833334,24.833334
0,1,,8.3166666,00:02:00,0,2,0,00:07:00,0,7,0,,,,,,17.316666,32.316666,24.316666,17.316666,24.316666
0,1,,6.5999999,00:01:00,0,1,0,00:13:00,0,13,0,,,,,,20.6,35.599998,27.6,20.6,27.6
0,0,,6.3833332,00:03:00,0,3,0,00:07:00,0,7,0,,,,,,16.383333,31.383333,23.383333,16.383333,23.383333
0,0,,6.8333335,00:02:00,0,2,0,00:07:00,0,7,0,,,,,,15.833334,30.833334,22.833334,15.833334,22.833334
0,1,,9.1999998,00:02:00,0,2,0,00:09:00,0,9,0,,,,,,20.200001,35.200001,27.200001,20.200001,27.200001
0,0,,11.883333,00:07:00,0,7,0,00:06:00,0,6,0,,,,,,24.883333,39.883331,31.883333,24.883333,31.883333
0,,,,00:01:00,0,1,0,,,,,,,,,,,,,,
0,1,,10.416667,00:04:00,0,4,0,00:11:00,0,11,0,,,,,,25.416668,40.416668,32.416668,25.416668,32.416668
0,0,,5.4833331,00:02:00,0,2,0,00:03:00,0,3,0,,,,,,10.483334,25.483334,17.483334,10.483334,17.483334
0,0,,5.3333335,00:02:00,0,2,0,00:04:00,0,4,0,,,,,,11.333334,26.333334,18.333334,11.333334,18.333334
0,0,,5.8666668,00:02:00,0,2,0,00:06:00,0,6,0,,,,,,13.866667,28.866667,20.866667,13.866667,20.866667
1,3,,9.6333332,00:01:00,0,1,0,00:11:00,0,11,0,,,,,,21.633333,36.633331,28.633333,21.633333,28.633333
0,0,,6.75,00:08:00,0,8,0,00:05:00,0,5,0,,,,,,19.75,34.75,26.75,19.75,26.75
0,1,,7.1500001,00:02:00,0,2,0,00:04:00,0,4,0,,,,,,13.15,28.15,20.15,13.15,20.15
0,0,,6.5,00:02:00,0,2,0,00:06:00,0,6,0,,,,,,14.5,29.5,21.5,14.5,21.5
0,,,,00:01:00,0,1,0,,,,,,,,,,,,,,
0,0,,8.3000002,00:02:00,0,2,0,00:06:00,0,6,0,,,,,,16.299999,31.299999,23.299999,16.299999,23.299999
0,1,,7.1833334,00:02:00,0,2,0,00:05:00,0,5,0,,,,,,14.183333,29.183334,21.183334,14.183333,21.183334
0,0,,6.6500001,00:02:00,0,2,0,00:11:00,0,11,0,,,,,,19.65,34.650002,26.65,19.65,26.65
0,0,,5.7166667,00:01:00,0,1,0,00:07:00,0,7,0,,,,,,13.716667,28.716667,20.716667,13.716667,20.716667
1,4,,7.0833335,00:03:00,0,3,0,00:10:00,0,10,0,,,,,,20.083334,35.083336,27.083334,20.083334,27.083334
0,0,,7.0999999,00:01:00,0,1,0,00:06:00,0,6,0,,,,,,14.1,29.1,21.1,14.1,21.1
0,0,,4.6833334,00:01:00,0,1,0,00:04:00,0,4,0,,,,,,9.6833334,24.683334,16.683334,9.6833334,16.683334
0,0,,6.7666669,00:03:00,0,3,0,,12,,0,,,,,,,,,,
0,1,,7.4000001,00:01:00,0,1,0,00:08:00,0,8,0,,,,,,16.4,31.4,23.4,16.4,23.4
0,0,,6.1999998,00:02:00,0,2,0,00:08:00,0,8,0,,,,,,16.200001,31.200001,23.200001,16.200001,23.200001
0,0,,6.4000001,00:05:00,0,5,0,00:03:00,0,3,0,,,,,,14.4,29.4,21.4,14.4,21.4
0,0,,7.5500002,00:03:00,0,3,0,00:08:00,0,8,0,,,,,,18.549999,33.549999,25.549999,18.549999,25.549999
0,0,,6.5833335,00:02:00,0,2,0,00:07:00,0,7,0,,,,,,15.583334,30.583334,22.583334,15.583334,22.583334
1,2,,10.3,00:02:00,0,2,0,00:05:00,0,5,0,,,,,,17.299999,32.299999,24.299999,17.299999,24.299999
0,1,,8.6499996,00:03:00,0,3,0,00:08:00,0,8,0,,,,,,19.65,34.650002,26.65,19.65,26.65
0,0,,5.0500002,00:02:00,0,2,0,00:08:00,0,8,0,,,,,,15.05,30.049999,22.049999,15.05,22.049999
0,0,,7.2166667,00:02:00,0,2,0,00:21:00,0,21,0,,,,,,30.216667,45.216667,37.216667,30.216667,37.216667
0,0,,8.7166662,00:02:00,0,2,0,00:06:00,0,6,0,,,,,,16.716667,31.716667,23.716667,16.716667,23.716667
0,1,,6.9499998,00:02:00,0,2,0,00:07:00,0,7,0,,,,,,15.95,30.950001,22.950001,15.95,22.950001
0,1,,7.3000002,00:07:00,0,7,0,00:05:00,0,5,0,,,,,,19.299999,34.299999,26.299999,19.299999,26.299999
0,0,,6.1166668,00:03:00,0,3,0,00:16:00,0,16,0,,,,,,25.116667,40.116669,32.116669,25.116667,32.116669
1,2,,13.65,00:05:00,0,5,0,00:06:00,0,6,0,,,,,,24.65,39.650002,31.65,24.65,31.65
1,3,,9.1833334,00:02:00,0,2,0,00:07:00,0,7,0,,,,,,18.183334,33.183334,25.183334,18.183334,25.183334
0,0,,8.8999996,,1,,0,00:14:00,0,14,0,,,,,,,,,,
0,1,,6.8833332,00:01:00,0,1,0,00:07:00,0,7,0,,,,,,14.883333,29.883333,21.883333,14.883333,21.883333
0,1,,8.083333,00:03:00,0,3,0,00:07:00,0,7,0,,,,,,18.083332,33.083332,25.083332,18.083332,25.083332
0,1,,6.4833331,00:02:00,0,2,0,,23,,0,,,,,,,,,,
0,0,,7.1166668,00:03:00,0,3,0,00:05:00,0,5,0,,,,,,15.116667,30.116667,22.116667,15.116667,22.116667
0,1,,7.0999999,00:02:00,0,2,0,00:08:00,0,8,0,,,,,,17.1,32.099998,24.1,17.1,24.1
0,,,,00:01:00,0,1,0,00:06:00,0,6,0,,,,,,,,,,
0,1,,7.2666669,00:02:00,0,2,0,00:07:00,0,7,0,,,,,,16.266666,31.266666,23.266666,16.266666,23.266666
0,1,,10.316667,00:03:00,0,3,0,00:07:00,0,7,0,,,,,,20.316666,35.316666,27.316666,20.316666,27.316666
1,3,,6.9833331,00:03:00,0,3,0,00:16:00,0,16,0,,,,,,25.983334,40.983334,32.983334,25.983334,32.983334
0,0,,7.8666668,00:04:00,0,4,0,00:06:00,0,6,0,,,,,,17.866667,32.866669,24.866667,17.866667,24.866667
0,0,,6.7666669,00:03:00,0,3,0,00:12:00,0,12,0,,,,,,21.766666,36.766666,28.766666,21.766666,28.766666
0,0,,4.8833332,00:04:00,0,4,0,00:09:00,0,9,0,,,,,,17.883333,32.883331,24.883333,17.883333,24.883333
0,,,,00:01:00,0,1,0,,,,,,,,,,,,,,
0,0,,7.2666669,00:02:00,0,2,0,00:03:00,0,3,0,,,,,,12.266666,27.266666,19.266666,12.266666,19.266666
0,0,,6.9666667,00:02:00,0,2,0,00:11:00,0,11,0,,,,,,19.966667,34.966667,26.966667,19.966667,26.966667
0,1,,8.2333336,00:02:00,0,2,0,00:06:00,0,6,0,,,,,,16.233334,31.233334,23.233334,16.233334,23.233334
0,0,,6.5666666,00:04:00,0,4,0,00:06:00,0,6,0,,,,,,16.566666,31.566666,23.566666,16.566666,23.566666
0,1,,7.2333331,00:02:00,0,2,0,00:14:00,0,14,0,,,,,,23.233334,38.233334,30.233334,23.233334,30.233334
0,0,,7.75,00:03:00,0,3,0,00:11:00,0,11,0,,,,,,21.75,36.75,28.75,21.75,28.75
0,0,,7.4499998,00:02:00,0,2,0,00:06:00,0,6,0,,,,,,15.45,30.450001,22.450001,15.45,22.450001
0,0,,5.3166666,00:02:00,0,2,0,00:20:00,0,20,0,,,,,,27.316666,42.316666,34.316666,27.316666,34.316666
0,0,,7.1500001,00:02:00,0,2,0,00:12:00,0,12,0,,,,,,21.15,36.150002,28.15,21.15,28.15
0,0,,10.133333,00:01:00,0,1,0,00:06:00,0,6,0,,,,,,17.133333,32.133331,24.133333,17.133333,24.133333
0,0,,7.0666666,00:06:00,0,6,0,00:25:00,0,25,0,,,,,,38.066666,53.066666,45.066666,38.066666,45.066666
0,0,,8.2333336,00:02:00,0,2,0,00:06:00,0,6,0,,,,,,16.233334,31.233334,23.233334,16.233334,23.233334
0,0,,7.2666669,00:01:00,0,1,0,00:08:00,0,8,0,,,,,,16.266666,31.266666,23.266666,16.266666,23.266666
0,1,,7.4166665,00:01:00,0,1,0,00:06:00,0,6,0,,,,,,14.416666,29.416666,21.416666,14.416666,21.416666
0,0,,8.3166666,00:03:00,0,3,0,00:05:00,0,5,0,,,,,,16.316666,31.316666,23.316666,16.316666,23.316666
0,1,,9.3833332,00:03:00,0,3,0,00:10:00,0,10,0,,,,,,22.383333,37.383331,29.383333,22.383333,29.383333
0,0,,5.4333334,00:02:00,0,2,0,00:04:00,0,4,0,,,,,,11.433333,26.433334,18.433334,11.433333,18.433334
0,1,,6.5,00:02:00,0,2,0,00:05:00,0,5,0,,,,,,13.5,28.5,20.5,13.5,20.5
1,2,,8.3500004,00:02:00,0,2,0,00:08:00,0,8,0,,,,,,18.35,33.349998,25.35,18.35,25.35
0,1,,7.6333332,00:03:00,0,3,0,00:07:00,0,7,0,,,,,,17.633333,32.633331,24.633333,17.633333,24.633333
0,0,,9.1166668,00:03:00,0,3,0,00:12:00,0,12,0,,,,,,24.116667,39.116669,31.116667,24.116667,31.116667
0,0,,6.5,00:02:00,0,2,0,00:07:00,0,7,0,,,,,,15.5,30.5,22.5,15.5,22.5
0,1,,9.166667,00:03:00,0,3,0,00:06:00,0,6,0,,,,,,18.166668,33.166668,25.166668,18.166668,25.166668
0,,,,00:00:00,0,,0,,,,,,,,,,,,,,
0,0,,7.4166665,00:01:00,0,1,0,00:05:00,0,5,0,,,,,,13.416666,28.416666,20.416666,13.416666,20.416666
0,1,,8.1999998,00:03:00,0,3,0,00:03:00,0,3,0,,,,,,14.2,29.200001,21.200001,14.2,21.200001
0,0,,7.0833335,00:03:00,0,3,0,00:07:00,0,7,0,,,,,,17.083334,32.083336,24.083334,17.083334,24.083334
0,0,,7.25,00:02:00,0,2,0,00:05:00,0,5,0,,,,,,14.25,29.25,21.25,14.25,21.25
0,0,,7.0666666,00:02:00,0,2,0,00:07:00,0,7,0,,,,,,16.066666,31.066666,23.066666,16.066666,23.066666
1,3,,9.4499998,00:02:00,0,2,0,00:12:00,0,12,0,,,,,,23.450001,38.450001,30.450001,23.450001,30.450001
0,0,,8.1166668,00:02:00,0,2,0,00:10:00,0,10,0,,,,,,20.116667,35.116669,27.116667,20.116667,27.116667
0,1,,6.4666667,00:02:00,0,2,0,00:08:00,0,8,0,,,,,,16.466667,31.466667,23.466667,16.466667,23.466667
0,0,,5.6833334,00:03:00,0,3,0,00:05:00,0,5,0,,,,,,13.683333,28.683334,20.683334,13.683333,20.683334
0,0,,7.1999998,00:02:00,0,2,0,00:09:00,0,9,0,,,,,,18.200001,33.200001,25.200001,18.200001,25.200001
0,0,,7.4333334,00:02:00,0,2,0,00:05:00,0,5,0,,,,,,14.433333,29.433334,21.433334,14.433333,21.433334
0,0,,6.0999999,00:02:00,0,2,0,00:04:00,0,4,0,,,,,,12.1,27.1,19.1,12.1,19.1
0,0,,4.9833331,00:03:00,0,3,0,00:10:00,0,10,0,,,,,,17.983334,32.983334,24.983334,17.983334,24.983334
0,,,,00:01:00,0,1,0,,,,,,,,,,,,,,
0,0,,6,00:02:00,0,2,0,00:07:00,0,7,0,,,,,,15,30,22,15,22
0,0,,8.2333336,00:03:00,0,3,0,00:09:00,0,9,0,,,,,,20.233334,35.233334,27.233334,20.233334,27.233334
0,0,,4.4833331,00:02:00,0,2,0,00:04:00,0,4,0,,,,,,10.483334,25.483334,17.483334,10.483334,17.483334
0,0,,8.2833338,00:01:00,0,1,0,00:04:00,0,4,0,,,,,,13.283334,28.283333,20.283333,13.283334,20.283333
0,0,,6.8166666,00:02:00,0,2,0,00:03:00,0,3,0,,,,,,11.816667,26.816666,18.816666,11.816667,18.816666
0,0,,4.3166666,00:05:00,0,5,0,00:04:00,0,4,0,,,,,,13.316667,28.316666,20.316666,13.316667,20.316666
0,0,,8.416667,00:05:00,0,5,0,00:06:00,0,6,0,,,,,,19.416668,34.416668,26.416668,19.416668,26.416668
0,1,,7.8833332,00:01:00,0,1,0,00:04:00,0,4,0,,,,,,12.883333,27.883333,19.883333,12.883333,19.883333
0,0,,6.5,00:02:00,0,2,0,00:09:00,0,9,0,,,,,,17.5,32.5,24.5,17.5,24.5
1,2,,8.6166668,00:03:00,0,3,0,00:11:00,0,11,0,,,,,,22.616667,37.616669,29.616667,22.616667,29.616667
0,0,,7.5833335,00:03:00,0,3,0,00:07:00,0,7,0,,,,,,17.583334,32.583336,24.583334,17.583334,24.583334
0,0,,7.0500002,00:02:00,0,2,0,00:06:00,0,6,0,,,,,,15.05,30.049999,22.049999,15.05,22.049999
0,0,,5.2666669,00:01:00,0,1,0,00:06:00,0,6,0,,,,,,12.266666,27.266666,19.266666,12.266666,19.266666
0,1,,9.8666668,00:04:00,0,4,0,00:08:00,0,8,0,,,,,,21.866667,36.866669,28.866667,21.866667,28.866667
1,3,,11.15,00:04:00,0,4,0,00:11:00,0,11,0,,,,,,26.15,41.150002,33.150002,26.15,33.150002
0,1,,7.1999998,00:01:00,0,1,0,00:06:00,0,6,0,,,,,,14.2,29.200001,21.200001,14.2,21.200001
0,0,,6.5666666,00:02:00,0,2,0,00:06:00,0,6,0,,,,,,14.566667,29.566666,21.566666,14.566667,21.566666
0,0,,8.0166664,00:02:00,0,2,0,00:08:00,0,8,0,,,,,,18.016666,33.016666,25.016666,18.016666,25.016666
0,1,,6.8000002,00:02:00,0,2,0,00:06:00,0,6,0,,,,,,14.8,29.799999,21.799999,14.8,21.799999
0,0,,7.8166666,00:01:00,0,1,0,00:09:00,0,9,0,,,,,,17.816666,32.816666,24.816666,17.816666,24.816666
0,1,,7.2666669,00:02:00,0,2,0,00:05:00,0,5,0,,,,,,14.266666,29.266666,21.266666,14.266666,21.266666
0,0,,6.8833332,00:02:00,0,2,0,00:05:00,0,5,0,,,,,,13.883333,28.883333,20.883333,13.883333,20.883333
1,2,,6.8333335,00:02:00,0,2,0,00:04:00,0,4,0,,,,,,12.833334,27.833334,19.833334,12.833334,19.833334